{"text_format":"1","workbook":"xlsx","n_sheets":16,"sheets":["Combined","VSGMSG8","LVL","Glulam","Steel","Flitch","Start","Input beam data","Print","Calc","Basic data","Results","Face loads","Schedule","Clean-up","Functionality"],"not_rendered":{"charts":0,"images":1,"macros":1,"external_links":0,"defined_names":52,"comments":12,"pivot_tables":0},"unopened":[],"bounds":{"document_bytes":16777216,"sheet_cells":100000,"rows_first":2000,"rows_last":500,"rows_between":2000,"halvings":0,"cell_chars":16384,"cell_head_chars":4096},"cells_cut":0,"cells_raw":0,"read":"whole","date_system":"1900"}

{"sheet":"Combined","index":0,"n_rows":109,"n_cols":8,"rows_kept":109,"cut":false,"hidden":true,"merged":[]}
["Combined member properties"]
[]
[null,1,2,3,4,5,6,7]
[null,"Section","EI(s) (green)","EI(s) (dry)","EI(l) (green)","EI(l) \n(dry)","Bearing width"]
[1,"70x45",5.6594999999999995,6.9457499999999994,2.8297499999999998,3.4728749999999997,45,"VSG/MSG8"]
[2,"90x45",12.028499999999999,14.76225,6.0142499999999997,7.3811249999999999,45]
[3,"140x45",45.275999999999996,55.565999999999995,22.637999999999998,27.782999999999998,45]
[4,"190x45",113.1735,138.89474999999999,56.586750000000002,69.447374999999994,45]
[5,"240x45",228.09600000000003,279.93599999999998,114.04800000000002,139.96799999999999,45]
[6,"290x45",402.41849999999999,493.87725,201.20925,246.938625,45]
[7,"90x70",18.710999999999999,22.963500000000003,9.3554999999999993,11.481750000000002,70]
[8,"140x70",70.429333333333346,86.436000000000007,35.214666666666673,43.218000000000004,70]
[9,"190x70",176.04766666666669,216.05850000000004,88.023833333333343,108.02925000000002,70]
[10,"240x70",354.81599999999997,435.45600000000002,177.40799999999999,217.72800000000001,70]
[11,"290x70",625.98433333333321,768.25349999999992,312.99216666666661,384.12674999999996,70]
[12,"2/90x45",29.797875000000001,36.632249999999999,14.898937500000001,18.316125,90]
[13,"2/140x45",112.16099999999999,137.886,56.080499999999994,68.942999999999998,90]
[14,"2/190x45",280.361625,344.66475000000003,140.1808125,172.33237500000001,90]
[15,"2/240x45",565.05600000000004,694.65599999999995,282.52800000000002,347.32799999999997,90]
[16,"2/290x45",996.90037500000005,1225.5472500000001,498.45018750000003,612.77362500000004,90]
[17,"90x90 (or 2/45x90)",24.056999999999999,29.5245,12.028499999999999,14.76225,90]
[18,"140x90",90.551999999999992,111.13199999999999,45.275999999999996,55.565999999999995,90]
[19,"190x90",226.34700000000001,277.78949999999998,113.1735,138.89474999999999,90]
[20,"240x90",456.19200000000006,559.87199999999996,228.09600000000003,279.93599999999998,90]
[21,"290x90",804.83699999999999,987.75450000000001,402.41849999999999,493.87725,90]
[22,null,null,0,null,0,45,"LVL"]
[23,"90 x45",null,88.154624999999996,null,58.769749999999995,45]
[24,"115x45",null,135.421875,null,90.28125,45]
[25,"140 x45",null,197.13412499999998,null,131.42274999999998,45]
[26,"190 x45",null,321,null,214,45]
[27,"240 x45",null,554.68799999999999,null,369.79199999999997,45]
[28,"300x45",null,1083.375,null,722.25,45]
[29,"360x45",null,1872.0719999999999,null,1248.048,45]
[30,"400x45",null,2568,null,1712,45]
[31,null,null,0,null,0,63]
[32,null,null,0,null,0,63]
[33,null,null,0,null,0,63]
[34,"170x63",null,275.987775,null,183.99185,63]
[35,"200x63",null,449.4,null,299.60000000000002,63]
[36,"240x63",null,776.56319999999994,null,517.7088,63]
[37,"300x63",null,1516.7249999999999,null,1011.15,63]
[38,"360x63",null,2620.9007999999999,null,1747.2672,63]
[39,"400x63",null,3595.2,null,2396.8000000000002,63]
[40,"460x63",null,5467.8498,null,3645.2332000000001,63]
[41,"610x63",null,12750.657674999999,null,8500.4384499999996,63]
[42,"150x90",null,240.46875,null,160.3125,90]
[43,"200x90",null,570,null,380,90]
[44,"240 x90",null,984.96,null,656.64,90]
[45,"300x90",null,1923.75,null,1282.5,90]
[46,"360x90",null,3324.24,null,2216.16,90]
[47,"400x90",null,4560,null,3040,90]
[48,"135x65",null,106.61624999999999,null,71.077500000000001,65,"Glulam"]
[49,"180x65",null,252.72,null,168.48,65]
[50,"225x65",null,493.59375,null,329.0625,65]
[51,"270x65",null,852.93,null,568.62,65]
[52,"315x65",null,1354.4212500000001,null,902.94749999999999,65]
[53,"360x65",null,2021.76,null,1347.84,65]
[54,"135x90",null,147.6225,null,98.415000000000006,90]
[55,"180x90",null,349.92,null,233.28,90]
[56,"225x90",null,683.4375,null,455.625,90]
[57,"270x90",null,1180.98,null,787.32,90]
[58,"315x90",null,1875.3525,null,1250.2349999999999,90]
[59,"360 x90",null,2799.36,null,1866.24,90]
[60,"405x90",null,3985.8074999999999,null,2657.2049999999999,90]
[61,"450x90",null,5467.5,null,3645,90]
[62,"150UB14",1400.7,1400.7,1400.7,1400.7,75,"Steel"]
[63,"150UB18",1900.5,1900.5,1900.5,1900.5,75]
[64,"180UB16",2226,2226,2226,2226,90]
[65,"180UB18",2541,2541,2541,2541,90]
[66,"180UB22",3213,3213,3213,3213,90]
[67,"200UB18",3318,3318,3318,3318,133]
[68,"200UB22",4410,4410,4410,4410,133]
[69,"200UB25",4956,4956,4956,4956,133]
[70,"200UB30",6069,6069,6069,6069,133]
[71,"250UB26",7434,7434,7434,7434,146]
[72,"250UB31",9324,9324,9324,9324,146]
[73,"250UB37",11886,11886,11886,11886,146]
[74,"310UB32",13272,13272,13272,13272,149]
[75,"310UB40",17892,17892,17892,17892,165]
[76,"310UB46",20895,20895,20895,20895,165]
[77,"360UB45",25410,25410,25410,25410,171]
[78,"360UB51",29820,29820,29820,29820,171]
[79,"360UB57",33810,33810,33810,33810,171]
[80,"410UB54",39060,39060,39060,39060,178]
[81,"410UB60",45150,45150,45150,45150,178]
[82,"100PFC",394.8,394.8,394.8,394.8,50]
[83,"125PFC",890.4,890.4,890.4,890.4,65]
[84,"150PFC",1751.4,1751.4,1751.4,1751.4,75]
[85,"180PFC",2961,2961,2961,2961,75]
[86,"200PFC",4011,4011,4011,4011,75]
[87,"230PFC",5628,5628,5628,5628,75]
[88,"250PFC",9471,9471,9471,9471,90]
[89,"300PFC",15204,15204,15204,15204,90]
[90,"380PFC",31920,31920,31920,31920,100]
[91,"FB15L",null,322.1516666666667,null,291.96766666666667,90,"Flitch (Mitek)"]
[92,"FB20M",null,1115.0608333333332,null,1039.6118333333332,90]
[93,"FB25L",null,1300.8,null,1148.7360000000001,90]
[94,"FB25M",null,2277.7024999999999,null,2125.6385,90]
[95,"FB30M",null,4053.8441666666663,null,3785.5651666666663,90]
[96,"150PF6",null,349.80604166666666,null,304.07270833333331,90,"Flitch (Pryda)"]
[97,"200PF6",null,893.45395833333339,null,779.13729166666667,90]
[98,"200PF8",null,1115.0608333333332,null,1000.7441666666665,90]
[99,"200PF10",null,1336.6677083333332,null,1222.3510416666668,90]
[100,"250PF6",null,1823.4768750000001,null,1593.076875,90]
[101,"250PF8",null,2277.7024999999999,null,2047.3025,90]
[102,"250PF10",null,2731.9281250000004,null,2501.5281250000003,90]
[103,"300PF6",null,3243.6247916666666,null,2837.1414583333335,90]
[104,"300PF8",null,4053.8441666666663,null,3647.3608333333336,90]
[105,"300PF10",null,4864.0635416666664,null,4457.5802083333328,90]

{"sheet":"VSGMSG8","index":1,"n_rows":53,"n_cols":13,"rows_kept":53,"cut":false,"hidden":true,"merged":[]}
["VSG/MSG8 properties",null,null,"(k1 = 1.0)",null,"Note:  I have offset all properties down 1 row to allow the Vlookup function to pick the correct size in the last column"]
[]
["Sorted by width",null,null,null,null,null,null,null,null,null,"Used for face load (wind only)"]
["fM (green)","fM (dry)","fM x k8","EI(s) (green)","EI(s) (dry)","EI(l) (green)","EI(l) (dry)","Index","Size","k8","fM (dry)","fM (dry)","EI(s) (dry)"]
[0,0,0,0,0,0,0,0,"70x45",1,0.2646,0.41160000000000002,2.8704375000000004]
[0.34397999999999995,0.41160000000000002,{"$f":"B6*J5","v":0.41160000000000002},5.6594999999999995,6.9457499999999994,2.8297499999999998,3.4728749999999997,1,"90x45",1,0.34020000000000006,0.68040000000000012,3.6905625]
[0.56862000000000001,0.68040000000000012,0.68040000000000012,12.028499999999999,14.76225,6.0142499999999997,7.3811249999999999,2,"140x45",1,0.5292,1.6464000000000001,5.7408750000000008]
[1.3759199999999998,1.6464000000000001,1.6464000000000001,45.275999999999996,55.565999999999995,22.637999999999998,27.782999999999998,3,"190x45",0.97197037037037037,0.71820000000000006,2.9474029511111111,7.7911875000000004]
[2.5342199999999999,3.0324,2.9474029511111111,113.1735,138.89474999999999,56.586750000000002,69.447374999999994,4,"240x45",0.85960000000000003,0.90720000000000001,4.1590886400000011,9.8414999999999999]
[4.0435199999999991,4.8384000000000009,4.1590886400000011,228.09600000000003,279.93599999999998,114.04800000000002,139.96799999999999,5,"290x45",0.70278518518518518,1.0962000000000001,4.9647556622222231,11.8918125]
[5.9038199999999996,7.0644000000000009,4.9647556622222231,402.41849999999999,493.87725,201.20925,246.938625,6,"X"]
[0,0,0,0,0,0,0,0,"90x70",1,0.82320000000000004,1.0584,17.235749999999999]
[0.88451999999999997,1.0584,{"$f":"B13*J12","v":1.0584},18.710999999999999,22.963500000000003,9.3554999999999993,11.481750000000002,1,"140x70",1,1.2805333333333333,2.5610666666666666,26.811166666666669]
[2.1403199999999996,2.5610666666666666,{"$f":"B14*J13","v":2.5610666666666666},70.429333333333346,86.436000000000007,35.214666666666673,43.218000000000004,2,"190x70",1,1.7378666666666669,4.7170666666666676,36.386583333333334]
[3.9421200000000001,4.7170666666666676,{"$f":"B15*J14","v":4.7170666666666676},176.04766666666669,216.05850000000004,88.023833333333343,108.02925000000002,3,"240x70",1.0004046647230322,2.1952000000000003,7.5294456685714302,45.962000000000003]
[6.2899200000000004,7.5264000000000006,{"$f":"B16*J15","v":7.5294456685714302},354.81599999999997,435.45600000000002,177.40799999999999,217.72800000000001,4,"290x70",0.97712186588921268,2.6525333333333339,10.989066666666668,55.537416666666665]
[9.1837199999999992,10.989066666666668,{"$f":"B17*J16","v":10.737657325714284},625.98433333333321,768.25349999999992,312.99216666666661,384.12674999999996,5,"X"]
[0,0,0,0,0,0,0,0,"2/90x45",1,0.7756559999999999,1.5513119999999998,9.1580624999999998]
[1.2964535999999998,1.5513119999999998,{"$f":"B19*J18","v":1.5513119999999998},29.797875000000001,36.632249999999999,14.898937500000001,18.316125,1,"2/140x45",1,1.2065759999999999,3.7537919999999994,14.245875000000002]
[3.1370975999999997,3.7537919999999994,{"$f":"B20*J19","v":3.7537919999999994},112.16099999999999,137.886,56.080499999999994,68.942999999999998,2,"2/190x45",1,1.6374959999999998,6.9138719999999996,19.3336875]
[5.7780215999999989,6.9138719999999996,{"$f":"B21*J20","v":6.9138719999999996},280.361625,344.66475000000003,140.1808125,172.33237500000001,3,"2/240x45",1,2.0684159999999996,11.031552,24.421500000000002]
[9.2192255999999997,11.031552,{"$f":"B22*J21","v":11.031552},565.05600000000004,694.65599999999995,282.52800000000002,347.32799999999997,4,"2/290x45",0.95,2.499336,16.106831999999997,29.5093125]
[13.460709599999998,16.106831999999997,{"$f":"B23*J22","v":15.301490399999997},996.90037500000005,1225.5472500000001,498.45018750000003,612.77362500000004,5,"X"]
[0,0,0,0,0,0,0,0,"90x90 (or 2/45x90)",1,1.3608000000000002,1.3608000000000002,36.632249999999999]
[1.13724,1.3608000000000002,{"$f":"B25*J24","v":1.3608000000000002},24.056999999999999,29.5245,12.028499999999999,14.76225,1,"140x90",1,2.1168,3.2928000000000002,56.983500000000006]
[2.7518399999999996,3.2928000000000002,{"$f":"B26*J25","v":3.2928000000000002},90.551999999999992,111.13199999999999,45.275999999999996,55.565999999999995,2,"190x90",1,2.8728000000000002,6.0648,77.33475]
[5.0684399999999998,6.0648,{"$f":"B27*J26","v":6.0648},226.34700000000001,277.78949999999998,113.1735,138.89474999999999,3,"240x90",1,3.6288,9.6768000000000018,97.686000000000007]
[8.0870399999999982,9.6768000000000018,{"$f":"B28*J27","v":9.6768000000000018},456.19200000000006,559.87199999999996,228.09600000000003,279.93599999999998,4,"290x90",1,4.3848000000000003,14.128800000000002,118.03725]
[11.807639999999999,14.128800000000002,{"$f":"B29*J28","v":14.128800000000002},804.83699999999999,987.75450000000001,402.41849999999999,493.87725,5,"X"]
[null,null,null,null,null,null,null,null,"350x100"]
[null,null,null,null,null,null,null,null,"400x100"]
[]
[0.34397999999999995,0.41160000000000002,null,5.6594999999999995,6.9457499999999994,2.8297499999999998,3.4728749999999997,1,"70x45"]
[0.56862000000000001,0.68040000000000012,null,12.028499999999999,14.76225,6.0142499999999997,7.3811249999999999,2,"90x45"]
[1.3759199999999998,1.6464000000000001,null,45.275999999999996,55.565999999999995,22.637999999999998,27.782999999999998,3,"140x45"]
[2.5342199999999999,3.0324,null,113.1735,138.89474999999999,56.586750000000002,69.447374999999994,4,"190x45"]
[4.0435199999999991,4.8384000000000009,null,228.09600000000003,279.93599999999998,114.04800000000002,139.96799999999999,5,"240x45"]
[5.9038199999999996,7.0644000000000009,null,402.41849999999999,493.87725,201.20925,246.938625,6,"290x45"]
[0.88451999999999997,1.0584,null,18.710999999999999,22.963500000000003,9.3554999999999993,11.481750000000002,7,"90x70"]
[2.1403199999999996,2.5610666666666666,null,70.429333333333346,86.436000000000007,35.214666666666673,43.218000000000004,8,"140x70"]
[3.9421200000000001,4.7170666666666676,null,176.04766666666669,216.05850000000004,88.023833333333343,108.02925000000002,9,"190x70"]
[6.2899200000000004,7.5264000000000006,null,354.81599999999997,435.45600000000002,177.40799999999999,217.72800000000001,10,"240x70"]
[9.1837199999999992,10.989066666666668,null,625.98433333333321,768.25349999999992,312.99216666666661,384.12674999999996,11,"290x70"]
[1.2964535999999998,1.5513119999999998,null,29.797875000000001,36.632249999999999,14.898937500000001,18.316125,12,"2/90x45"]
[3.1370975999999997,3.7537919999999994,null,112.16099999999999,137.886,56.080499999999994,68.942999999999998,13,"2/140x45"]
[5.7780215999999989,6.9138719999999996,null,280.361625,344.66475000000003,140.1808125,172.33237500000001,14,"2/190x45"]
[9.2192255999999997,11.031552,null,565.05600000000004,694.65599999999995,282.52800000000002,347.32799999999997,15,"2/240x45"]
[13.460709599999998,16.106831999999997,null,996.90037500000005,1225.5472500000001,498.45018750000003,612.77362500000004,16,"2/290x45"]
[1.13724,1.3608000000000002,null,24.056999999999999,29.5245,12.028499999999999,14.76225,17,"90x90 (or 2/45x90)"]
[2.7518399999999996,3.2928000000000002,null,90.551999999999992,111.13199999999999,45.275999999999996,55.565999999999995,18,"140x90"]
[5.0684399999999998,6.0648,null,226.34700000000001,277.78949999999998,113.1735,138.89474999999999,19,"190x90"]
[8.0870399999999982,9.6768000000000018,null,456.19200000000006,559.87199999999996,228.09600000000003,279.93599999999998,20,"240x90"]
[11.807639999999999,14.128800000000002,null,804.83699999999999,987.75450000000001,402.41849999999999,493.87725,21,"290x90"]

{"sheet":"LVL","index":2,"n_rows":33,"n_cols":10,"rows_kept":33,"cut":false,"hidden":true,"merged":[]}
["LVL section properties",null,null,null,null,"Note:  I have offset all properties down 1 row to allow the Vlookup function to pick the correct size in the last column"]
[null,null,null,null,"Data from:","Nelson Pine",null,"CHH"]
["Sorted by width",null,null,null,null,null,null,"Used for face load (wind only)"]
["fM (dry)","fM x k8","EI(s)","EI(l)","Index","Size","k8","fM (dry)","fM (dry)","EI(s) (dry)"]
[0,0,0,0,0]
[0,0,0,0,1,"90 x45",1,1.0388250000000001,2.0776500000000002,7.5178124999999998]
[2.0776500000000002,{"$f":"A7*G6","v":2.0776500000000002},88.154624999999996,58.769749999999995,2,"115x45",1,1.3273874999999999,3.2856882365427387,9.6060937499999994]
[3.2856882365427387,3.2856882365427387,135.421875,90.28125,3,"140 x45",0.99451851851851847,1.61595,4.686329007049288,11.694375000000003]
[4.7121586172475336,4.686329007049288,197.13412499999998,131.42274999999998,4,"190 x45",0.95518518518518547,2.1930750000000003,7.8778941294843516,15.8709375]
[8.2475045171026533,7.8778941294843516,321,214,5,"240 x45",0.85960000000000003,2.7702000000000004,10.879046283465657,20.047499999999999]
[12.655940301844645,10.879046283465657,554.68799999999999,369.79199999999997,6,"300x45",0.67,3.4627500000000007,12.764543101572142,25.059375000000003]
[19.051556868018121,12.764543101572142,1083.375,722.25,7,"360x45",0.49319999999999986,4.1553000000000004,13.124802089910363,30.071249999999999]
[26.611520863565218,13.124802089910363,1872.0719999999999,1248.048,8,"400x45",0.42037037037037184,4.617,13.56985706073824,33.412500000000001]
[32.280717236998342,13.56985706073824,2568,1712,9,"X"]
[0,0,0,0,0]
[0,0,0,0,1]
[0,0,0,0,2]
[0,0,0,0,3,"170x63",1,3.8459610000000004,9.4169035021435903,38.965657499999999]
[9.4169035021435903,{"$f":"A19*G18","v":9.4169035021435903},275.987775,183.99185,4,"200x63",1,4.5246600000000008,12.68478846665759,45.841949999999997]
[12.68478846665759,12.68478846665759,449.4,299.60000000000002,5,"240x63",0.9934402332361516,5.4295920000000004,17.602088399402291,55.010339999999999]
[17.718316422582497,17.602088399402291,776.56319999999994,517.7088,6,"300x63",0.92574344023323629,6.7869899999999994,24.691595315517528,68.76292500000001]
[26.672179615225367,24.691595315517528,1516.7249999999999,1011.15,7,"360x63",0.80860058309037885,8.1443879999999993,30.125327802080864,82.515509999999992]
[37.256129208991304,30.125327802080864,2620.9007999999999,1747.2672,8,"400x63",0.71685671093834347,9.0493200000000016,32.396908299343458,91.683899999999994]
[45.193004131797693,32.396908299343458,3595.2,2396.8000000000002,9,"460x63",0.57950005398984938,10.406718000000001,33.836375307941779,105.43648499999999]
[58.388907947426112,33.836375307941779,5467.8498,3645.2332000000001,10,"610x63",0.40753698304718711,13.800213000000001,39.918283745726484,139.81794749999997]
[97.950088964329652,39.918283745726484,12750.657674999999,8500.4384499999996,11,"X"]
[0,0,0,0,0,"150x90",1,6.1965000000000003,9.6260161276403604,86.568749999999994]
[9.6260161276403604,9.6260161276403604,240.46875,160.3125,1,"200x90",1,8.2620000000000005,16.371312282721142,115.425]
[16.371312282721142,16.371312282721142,570,380,2,"240 x90",1,9.9143999999999988,22.921977027985687,138.51]
[22.921977027985687,22.921977027985687,984.96,656.64,3,"300x90",1,12.393000000000001,34.605725374228903,173.13749999999999]
[34.605725374228903,34.605725374228903,1923.75,1282.5,4,"360x90",0.98519999999999974,14.871600000000001,48.452538707117625,207.76499999999999]
[48.452538707117625,48.452538707117625,3324.24,2216.16,5,"400x90",0.95518518518518547,16.524000000000001,58.855203373782984,230.85]
[58.855203373782984,58.855203373782984,4560,3040,6,"X"]

{"sheet":"Glulam","index":3,"n_rows":22,"n_cols":8,"rows_kept":22,"cut":false,"hidden":true,"merged":[]}
["Glulam (GL8)",null,null,null,"Note:  I have offset all properties down 1 row to allow the Vlookup function to pick the correct size in the last column"]
[]
["Sorted by width",null,null,null,null,"Used for face load (wind only)"]
["fM (dry)","EI(s)","EI(l)","Index","Size","fM (dry)","fM (dry)","EI(s) (dry)"]
[0,0,0,0,"135x65",1.3871520000000002,2.4008400000000005,24.716249999999999]
[2.4008400000000005,106.61624999999999,71.077500000000001,1,"180x65",1.9111872000000005,4.2681600000000008,32.954999999999998]
[4.2681600000000008,252.72,168.48,2,"225x65",2.4275160000000002,6.6690000000000005,41.193750000000001]
[6.6690000000000005,493.59375,329.0625,3,"270x65",2.9592576000000008,9.6033600000000021,49.432499999999997]
[9.6033600000000021,852.93,568.62,4,"315x65",3.5064120000000005,12.965168811695746,57.671250000000001]
[12.835517123578787,1354.4212500000001,902.94749999999999,5,"360x65",4.0381536000000002,18.879142562485264,65.91]
[18.312768285610701,2021.76,1347.84,6,"X"]
[0,0,0,0,"135x90",2.6593920000000004,3.3242400000000005,65.61]
[3.3242400000000005,147.6225,98.415000000000006,1,"180x90",3.6640512000000007,5.9097600000000012,87.48]
[5.9097600000000012,349.92,233.28,2,"225x90",4.6539360000000007,9.2340000000000018,109.35]
[9.2340000000000018,683.4375,455.625,3,"270x90",5.6733696000000009,13.296960000000002,131.22]
[13.296960000000002,1180.98,787.32,4,"315x90",6.7223520000000017,17.951772200809494,153.09]
[17.951772200809494,1875.3525,1250.2349999999999,5,"360 x90",7.7417856000000009,26.140351240364211,174.96]
[25.35614070315328,2799.36,1866.24,6,"405x90",8.7759936000000032,32.439488104375471,196.83]
[30.817513699156695,3985.8074999999999,2657.2049999999999,7,"450x90",9.8249760000000013,39.350247893724621,218.7]
[36.595730541163896,5467.5,3645,8,"X"]
[]
[null,"Indicates values different from \"Timber sections\" spreadsheet"]

{"sheet":"Steel","index":4,"n_rows":84,"n_cols":34,"rows_kept":84,"cut":false,"hidden":true,"merged":[]}
["Hot rolled steel properties",null,null,null,null,"fy changed see col C",null,null,null,"fy",320,null,"Note:  I have offset all properties (columns A - F) down 1 row to allow the Vlookup function to pick the correct size in the last column"]
[null,null,"Others","Lintel up","Lintel dn",null,null,null,null,null,300,null,"Lintels up",null,"On the assumption partially restrained at ends, and unrestrained between",null,null,null,null,null,null,null,"Others",null,"Lintels down",null,null,null,"Face loading parameters"]
["Iex","Zex","fM","faaM","faaM","EI","Index","Size",null,"f",0.9,"kt","Iw","J","alpha m","Iy","Mo","alpha s","am x as",null,"Mo","alpha s","am x as",null,"Mo","alpha s","am x as",null,"Iey","Zey","fMy","fMx","faaMx","EIy"]
[0,0,0,0,0,0,1,"150UB14",null,null,null,{"$f":"2*LEFT(H4,3)/(Span*1000)+1","v":1.1000000000000001},2.5299999999999998,28.2,{"$f":"1.7/(0.75^2*2+1)^0.5","v":1.16619037896906},0.496,{"$f":"((PI()^2*205*P4/1000000)/Span^2*(80*N4/1000000000+(PI()^2*205*M4/1000000000/Span^2)))^0.5*1000000","v":17.747509737604446},{"$f":"0.6*(((C5/K$3/Q4)^2+3)^0.5-(C5/K$3/Q4))","v":0.41232643050194012},{"$f":"MIN(O4*R4,1)","v":0.48085111624601734},null,{"$f":"((PI()^2*205*$P4/1000000)/(1.2)^2*(80*$N4/1000000000+(PI()^2*205*$M4/1000000000/(1.2)^2)))^0.5*1000000","v":63.636059285800116},{"$f":"0.6*((($C5/$K$3/U4)^2+3)^0.5-($C5/$K$3/U4))","v":0.77609039198875462},{"$f":"MIN($O4*V4,1)","v":0.9050691483476121},null,{"$f":"((PI()^2*205*$P4/1000000)/(Span*1.2)^2*(80*$N4/1000000000+(PI()^2*205*$M4/1000000000/(Span*1.2)^2)))^0.5*1000000","v":14.327417648480777},{"$f":"0.6*((($C5/$K$3/Y4)^2+3)^0.5-($C5/$K$3/Y4))","v":0.35019720314871694},{"$f":"MIN($O4*Z4,1)","v":0.40839660905390707},null,0.495,20.8,{"$f":"$K$3*$K$1*AD4/1000","v":5.9904000000000002},18.252209712984538,24.236327778605396,{"$f":"AC4*210","v":103.95}]
[6.67,102,{"$f":"$K$3*$K$1*B5/1000","v":29.376000000000001},{"$f":"C5*S4","v":14.125482390843006},{"$f":"C5*AA4","v":11.997058787567575},{"$f":"A5*210","v":1400.7},2,"150UB18",null,null,{"$f":"Span&\" m\"","v":"3 m"},1.1000000000000001,3.56,60.4,{"$f":"1.7/(0.75^2*2+1)^0.5","v":1.16619037896906},0.67200000000000004,29.169814190401105,0.47874037650233731,{"$f":"MIN(O5*R5,1)","v":0.55830242110105122},null,{"$f":"((PI()^2*205*$P5/1000000)/(1.2)^2*(80*$N5/1000000000+(PI()^2*205*$M5/1000000000/(1.2)^2)))^0.5*1000000","v":96.359522844718811},{"$f":"0.6*((($C6/$K$3/U5)^2+3)^0.5-($C6/$K$3/U5))","v":0.80448632164851352},{"$f":"MIN($O5*V5,1)","v":0.93818420831870508},null,23.774623249269897,{"$f":"0.6*((($C6/$K$3/Y5)^2+3)^0.5-($C6/$K$3/Y5))","v":0.41595548565671508},{"$f":"MIN($O5*Z5,1)","v":0.48508328545226398},null,0.67200000000000004,28.2,8.121599999999999,26.864654078926137,33.813127217949244,{"$f":"AC5*210","v":141.12}]
[9.0500000000000007,135,38.880000000000003,{"$f":"C6*S5","v":21.706798132408874},{"$f":"C6*AA5","v":18.860038138384024},1900.5000000000002,3,"180UB16",null,null,null,1.1200000000000001,5.88,31.5,1.16619037896906,0.85299999999999998,27.142593409703114,0.44962828843856284,0.52435218408937745,null,113.67456969049377,0.83196252589265518,0.97022669335881195,null,21.396834029299871,0.37829403288243119,0.44116286156889645,null,0.85299999999999998,29.4,8.4671999999999983,27.151918089845726,35.580146158461758,179.13]
[10.6,138,39.744,20.839853204448218,17.53357677019422,2226,4,"180UB18",null,null,null,1.1200000000000001,6.8,45,1.16619037896906,0.97499999999999998,33.528271775317151,0.475096775534529,0.55405328870759085,null,134.24006537251674,0.8386610740492545,0.97803847577209901,null,26.637516183974618,0.40478815808441021,0.4720600554786461,null,0.97499999999999998,33.700000000000003,9.7056000000000004,31.95029742888817,41.009203617328303,204.75]
[12.1,157,45.216000000000001,25.052073502202429,21.344667468522463,2541,5,"180UB22","Flange width < 90mm",null,null,1.1200000000000001,8.7100000000000009,82,1.16619037896906,1.22,48.334383718938078,0.5481544361226538,0.63925242959544903,null,179.50680256927879,0.86526159147477444,1,null,38.838335985926193,0.4800355609883909,0.5598128527876769,null,1.22,42.3,12.182399999999999,40.086054093578049,48.923304412119485,256.2]
[15.3,179,51.552,32.95474125050459,28.85947218691032,3213,6,"200UB18",null,null,null,1.1333333333333333,10.4,38.6,1.16619037896906,1.1399999999999999,37.290469703946847,0.46567204753768732,0.54306226159327364,null,168.38008364704021,0.85405528458153879,0.99599105598667304,null,28.95752464370068,0.38904980915261156,0.45370614437352452,null,1.1399999999999999,35.700000000000003,10.281600000000001,36.867412396367541,47.924529643227089,239.39999999999998]
[15.8,180,51.84,28.152347640995309,23.520126524323512,3318,7,"200UB22",null,null,null,1.1333333333333333,26,45,1.16619037896906,2.75,76.413986043974759,0.61509441730464243,0.71731719161825402,null,393.77960193659686,0.93442660434740676,1,null,57.342609555740175,0.52745231546770677,0.61510981566339318,null,2.75,63.4,18.2592,57.55085314033375,65.376000000000005,577.5]
[21,227,65.376000000000005,46.895328719234982,40.213419308809996,4410,8,"200UB25",null,null,null,1.1333333333333333,29.5,61,1.16619037896906,3.1,89.569159902884351,0.62531678515927769,0.72923841866061234,null,449.21314120167756,0.93517421711830495,1,null,67.753816992140173,0.54073054582861224,0.63059476016001592,null,3.06,70.900000000000006,20.4192,65.608563010995624,74.016000000000005,642.6]
[23.6,257,74.016000000000005,53.975310795583887,46.674101768003744,4956,9,"200UB30","Flange width < 140mm",null,null,1.1333333333333333,37.299999999999997,102,1.16619037896906,3.84,119.51125837843006,{"$f":"0.6*(((C13/K$3/Q12)^2+3)^0.5-(C13/K$3/Q12))","v":0.65164586362522925},0.75994313665472646,null,571.6547373227977,{"$f":"0.6*((($C13/$K$3/U12)^2+3)^0.5-($C13/$K$3/U12))","v":0.93940774258324777},1,null,91.557159452148127,{"$f":"0.6*((($C13/$K$3/Y12)^2+3)^0.5-($C13/$K$3/Y12))","v":0.57278162967899349},0.66797242578186122,null,3.86,88.4,{"$f":"$K$3*$K$1*AD12/1000","v":25.459199999999999},81.585347176105287,90.144000000000005,810.6]
[28.9,313,{"$f":"$K$3*$K$1*B13/1000","v":90.144000000000005},{"$f":"C13*S12","v":68.504314110603673},{"$f":"C13*AA12","v":60.213706349680102},{"$f":"A13*210","v":6069},10,"250UB26","Extra section added",null,null,1.1666666666666667,36.700000000000003,67.400000000000006,1.16619037896906,2.5499999999999998,88.434490965061784,0.5907276072546026,0.68890085217173103,null,451.74169468283816,0.92513493401266422,1,null,66.538889206728442,0.50287947233853614,0.58645320242223842,null,2.5499999999999998,63.6,{"$f":"$K$3*$K$1*AD13/1000","v":18.316800000000001},70.298823051102701,82.08,535.5]
[35.4,285,{"$f":"$K$3*$K$1*B14/1000","v":82.08},56.544981946255682,{"$f":"C14*AA13","v":48.136078854817328},{"$f":"A14*210","v":7434},11,"250UB31",null,null,null,{"$f":"2*LEFT(H14,3)/(Span*1000)+1","v":1.1666666666666667},66.2,87.3,1.16619037896906,4.49,148.56484033760694,0.65025568994933336,0.75832192948880062,null,794.26376225086199,0.94900209252056245,1,null,110.18125616506373,0.5613236543318203,0.65461024516952315,null,4.47,94.2,{"$f":"$K$3*$K$1*AD14/1000","v":27.129600000000003},103.18895452013254,112.608,938.69999999999993]
[44.4,391,112.608,85.393115835874866,{"$f":"C15*AA14","v":73.714350488049661},9324,12,"250UB37",null,null,null,1.1666666666666667,85.8,155,1.16619037896906,5.71,201.68538206465877,0.67546948485250768,0.78772601452218161,null,1032.7919736793904,0.95297106153360533,1,null,151.6381057344334,0.59301487618735649,0.69156824319522348,null,5.66,119,34.271999999999998,130.39433105261222,99.127362322545906,1188.6000000000001]
[56.6,485,139.68,110.02956970845833,99.127362322545906,11886,13,"310UB32",null,null,null,1.2066666666666666,92.9,86.5,1.16619037896906,4.42,166.21692852847394,0.63145537060798584,0.73639717795137527,null,923.90517022492941,0.94670320130417918,1,null,121.58437641978242,0.53684131640721267,0.62605917822717638,null,4.42,91.8,26.438399999999998,121.65768661768209,69.6665430919073,928.19999999999993]
[63.2,467,134.49600000000001,99.042474845748174,69.6665430919073,13272,14,"310UB40",null,null,null,1.2066666666666666,164,147,1.16619037896906,7.63,{"$f":"((PI()^2*205*P17/1000000)/Span^2*(80*N17/1000000000+(PI()^2*205*M17/1000000000/Span^2)))^0.5*1000000","v":288.81055142892825},0.70539054095418308,0.82261966227654892,null,1611.3281694146517,0.97217192646844797,1,null,210.96382373300696,0.61779572222649115,0.72046742742877579,null,7.65,142,40.896000000000001,173.11881472260742,178.84800000000001,1606.5]
[85.2,621,178.84800000000001,147.12388135883623,{"$f":"C18*AA17","v":128.85415846078169},17892,15,"310UB46",null,null,null,1.2066666666666666,196,223,1.16619037896906,8.9700000000000006,353.30937762963413,0.73423242114453369,0.85625478546591416,null,1922.4077939129068,0.97373669467622803,1,null,260.44576540267525,0.65343655719632132,0.76203142626901577,null,9.01,166,47.808,203.19254469267437,208.22399999999999,1892.1]
[99.5,723,{"$f":"$K$3*$K$2*B19/1000","v":195.21},167.14949667080111,148.75615472197458,{"$f":"A19*210","v":20895},16,"360UB45",null,null,null,1.24,238,157,1.16619037896906,8.1199999999999992,347.26956724633322,0.70077226752163491,0.81723387623206289,null,1989.592545423528,0.97274478820632504,1,null,251.04359132806704,0.60948386261009979,0.71077421671279872,null,8.1,146,42.048000000000002,211.66302325555276,218.88,1701]
[121,760,218.88,178.87615082967392,155.57426055409738,25410,17,"360UB51",null,null,null,1.24,286,236,1.16619037896906,9.68,425.44125849179528,0.72740290241089511,0.84829026642575589,null,2392.1131392917368,0.9740640413012438,1,null,309.84822340415855,0.64210470833874234,0.74881633315537566,null,9.6,173,{"$f":"$K$3*$K$2*AD20/1000","v":46.71},238.42362593048102,241.65,2016]
[142,895,{"$f":"$K$3*$K$2*B21/1000","v":241.65},204.98934288178393,180.95146690699653,29820,18,"360UB57",null,null,null,1.24,331,331,1.16619037896906,11.1,501.75761256382424,0.73825549461227291,0.86094645503787737,null,2768.7979641427028,0.97564241725814926,1,null,368.01277150036844,0.65666501022135049,0.76579641712575841,null,11,198,{"$f":"$K$3*$K$2*AD21/1000","v":53.46},270.93665257018199,272.7,2310]
[161,1010,{"$f":"$K$3*$K$2*B22/1000","v":272.7},234.78009828882915,208.83268295019431,33810,19,"410UB54",null,null,null,1.2733333333333334,390,227,1.16619037896906,10.199999999999999,492.62932669816394,0.71014525414036778,0.82816456304903485,null,2848.4146721205457,0.97558572829825996,1,null,354.78292318593418,0.61902711382933939,0.72190346446876075,null,10.3,179,{"$f":"$K$3*$K$1*AD22/1000","v":51.552},292.22067137616779,299.52,2163]
[186,1040,{"$f":"$K$3*$K$1*B23/1000","v":299.52},248.05184992444691,216.2245256776832,39060,20,"410UB60","Flange width < 190mm",null,null,1.2733333333333334,464,329,1.16619037896906,12,593.63416207543719,0.7392612762791958,0.86211938794118625,null,3381.6993022629958,0.97781806897423573,1,null,430.13137056336973,0.65439771763128118,0.76315232232091168,null,12.1,209,{"$f":"$K$3*$K$2*AD23/1000","v":56.43},320.46069196190143,321.3,2541]
[215,1190,{"$f":"$K$3*$K$2*B24/1000","v":321.3},276.99895934550318,245.20084116170892,45150,21,"X"]
[]
[0,0,0,{"$f":"C26*S25","v":0},0,0,1,"100PFC",null,null,null,{"$f":"2*LEFT(H26,3)/(Span*1000)+1","v":1.0666666666666667},0.42399999999999999,13.2,1.16619037896906,0.26700000000000002,{"$f":"((PI()^2*205*P26/1000000)/Span^2*(80*N26/1000000000+(PI()^2*205*M26/1000000000/Span^2)))^0.5*1000000","v":8.3130216318299706},{"$f":"0.6*(((C27/K$3/Q26)^2+3)^0.5-(C27/K$3/Q26))","v":0.43521281834098002},{"$f":"MIN(O26*R26,1)","v":0.5075410015532601},null,{"$f":"((PI()^2*205*$P26/1000000)/(1.2)^2*(80*$N26/1000000000+(PI()^2*205*$M26/1000000000/(1.2)^2)))^0.5*1000000","v":24.892703647854169},{"$f":"0.6*((($C27/$K$3/U26)^2+3)^0.5-($C27/$K$3/U26))","v":0.75227129974184526},{"$f":"MIN($O26*V26,1)","v":0.87729155213348986},null,{"$f":"((PI()^2*205*$P26/1000000)/(Span*1.2)^2*(80*$N26/1000000000+(PI()^2*205*$M26/1000000000/(Span*1.2)^2)))^0.5*1000000","v":6.839333502419283},{"$f":"0.6*((($C27/$K$3/Y26)^2+3)^0.5-($C27/$K$3/Y26))","v":0.37705368677597367},{"$f":"MIN($O26*Z26,1)","v":0.43971638187295398},null,0.26700000000000002,8.01,{"$f":"$K$3*$K$1*AD26/1000","v":2.30688},8.0664267188258396,10.293033851764395,{"$f":"AC26*210","v":56.07}]
[1.88,44.3,{"$f":"$K$3*$K$1*B27/1000","v":12.7584},6.4754111142171134,{"$f":"C27*AA26","v":5.6100774864878957},{"$f":"A27*210","v":394.79999999999995},2,"125PFC",null,null,null,1.0833333333333333,1.64,23.1,1.16619037896906,0.65800000000000003,{"$f":"((PI()^2*205*P27/1000000)/Span^2*(80*N27/1000000000+(PI()^2*205*M27/1000000000/Span^2)))^0.5*1000000","v":18.107998214746321},0.49595839149179932,0.5783819045267069,null,{"$f":"((PI()^2*205*$P27/1000000)/(1.2)^2*(80*$N27/1000000000+(PI()^2*205*$M27/1000000000/(1.2)^2)))^0.5*1000000","v":61.958620521441375},0.82215096081788863,0.95878454056599027,null,14.701556264136334,0.43151558051736577,0.50322931837460072,null,0.65800000000000003,15.2,4.3775999999999993,16.294456415535318,20.37097656192498,{"$f":"AC27*210","v":138.18}]
[4.24,79.3,22.838399999999996,13.20931728834274,11.492952464766478,{"$f":"A28*210","v":890.40000000000009},3,"150PFC",null,null,null,1.1000000000000001,4.59,54.9,1.16619037896906,1.29,{"$f":"((PI()^2*205*P28/1000000)/Span^2*(80*N28/1000000000+(PI()^2*205*M28/1000000000/Span^2)))^0.5*1000000","v":39.660202290634906},0.60732956043195852,0.70826189023925834,null,140.17755547358482,0.88670219179582566,1,null,32.075173859007677,0.54259309709032399,0.63276684952176088,null,1.29,25.7,7.4015999999999993,30.243571836633294,36.001476828254845,270.90000000000003]
[8.34,129,{"$f":"$K$3*$K$2*B29/1000","v":34.83},24.668761637033366,22.03926936884293,1751.3999999999999,4,"180PFC",null,null,null,1.1200000000000001,7.82,81.400000000000006,1.16619037896906,1.51,52.98423502181415,0.59095526341801852,0.68916634259921972,null,192.68438910979654,0.88302730758262915,1,null,42.6954918006276,0.52450317907481647,0.61167056117573693,null,1.51,29.9,8.6111999999999984,41.912755415794713,50.428103172923656,317.10000000000002]
[14.1,182,49.14,33.865634075325659,30.057491376175712,2961,5,"200PFC",null,null,null,1.1333333333333333,10.6,101,1.16619037896906,1.65,{"$f":"((PI()^2*205*P30/1000000)/Span^2*(80*N30/1000000000+(PI()^2*205*M30/1000000000/Span^2)))^0.5*1000000","v":62.29810365668888},0.58118545287687717,0.67777288354179011,null,{"$f":"((PI()^2*205*$P30/1000000)/(1.2)^2*(80*$N30/1000000000+(PI()^2*205*$M30/1000000000/(1.2)^2)))^0.5*1000000","v":230.78159984782488},0.88105777439084199,1,null,{"$f":"((PI()^2*205*$P30/1000000)/(Span*1.2)^2*(80*$N30/1000000000+(PI()^2*205*$M30/1000000000/(Span*1.2)^2)))^0.5*1000000","v":50.076106298847165},0.5136828619315883,0.59905201142591025,null,1.65,32.700000000000003,9.4176000000000002,50.355540878460438,60.987895284741484,346.5]
[19.100000000000001,221,59.67,40.44270796093862,35.745433521784065,4011.0000000000005,6,"230PFC",null,null,null,1.1533333333333333,15,108,1.16619037896906,1.76,68.940054140052439,0.54967060355821329,0.64102056947170472,null,271.07845595102623,0.8747469561122061,1,null,54.930852845451284,0.47893801629514815,0.55853290672592859,null,1.76,33.6,9.6768000000000018,59.624940244284936,73.822551691601021,369.6]
[26.8,271,73.17,46.903475068244639,40.867852785136193,5628,7,"250PFC",null,null,null,1.1666666666666667,35.9,238,1.16619037896906,3.64,148.94494337796769,0.64831070589057682,0.75605370779223058,null,596.11487603693161,0.91985359174080461,1,null,118.34112749146939,0.5803242326321657,0.67676853677823423,null,3.64,59.3,17.078399999999998,105.07358428965998,121.248,764.4]
[45.1,421,113.67,85.940624964742852,76.928279575581882,9471,8,"300PFC","Flange width < 90mm",null,null,1.2,58.2,290,1.16619037896906,4.04,181.5317718307933,0.62090753379716457,0.72409639214365973,null,771.92777489249897,0.91600415887444731,1,null,142.69933373856014,0.54798937148407612,0.63905993280203166,null,4.04,64.400000000000006,18.5472,137.34863771960488,162.43199999999999,848.4]
[72.400000000000006,564,152.28,110.2653985956365,97.31604656709338,15204.000000000002,9,"380PFC","Flange width < 140mm",null,null,1.2533333333333334,151,472,1.16619037896906,6.48,323.1994898990863,0.63829447400613315,0.74437287453506917,null,1508.4659086856138,0.93246037229396483,1,null,249.09267977688987,0.56030830121199371,0.65342615012992511,null,6.48,89.4,25.747199999999999,237.76225696257086,272.44799999999998,1360.8000000000002]
[152,946,255.42,190.12771961374736,166.89810726618546,31920,10,"X"]
[]
[null,null,"Others","Lintel up","Lintel dn",null,null,null,"This data used for lintels under upwards loading (Case 8)"]
["Iex","Zex","fM","faaM","faaM","EI","Index","Size"]
[0,0,0,{"$f":"D4","v":0},{"$f":"E4","v":0},0,1,"150UB14"]
[6.67,102,29.376000000000001,{"$f":"D5","v":14.125482390843006},{"$f":"E5","v":11.997058787567575},1400.7,2,"150UB18"]
[10.6,138,39.744,{"$f":"D7","v":20.839853204448218},{"$f":"E7","v":17.53357677019422},2226,4,"180UB18"]
[9.0500000000000007,135,38.880000000000003,{"$f":"D6","v":21.706798132408874},{"$f":"E6","v":18.860038138384024},1900.5000000000002,3,"180UB16"]
[12.1,157,45.216000000000001,{"$f":"D8","v":25.052073502202429},{"$f":"E8","v":21.344667468522463},2541,5,"180UB22"]
[15.8,180,51.84,{"$f":"D10","v":28.152347640995309},{"$f":"E10","v":23.520126524323512},3318,7,"200UB22"]
[15.3,179,51.552,{"$f":"D9","v":32.95474125050459},{"$f":"E9","v":28.85947218691032},3213,6,"200UB18"]
[21,227,65.376000000000005,{"$f":"D11","v":46.895328719234982},{"$f":"E11","v":40.213419308809996},4410,8,"200UB25"]
[23.6,257,74.016000000000005,{"$f":"D12","v":53.975310795583887},{"$f":"E12","v":46.674101768003744},4956,9,"200UB30"]
[35.4,285,82.08,{"$f":"D14","v":56.544981946255682},{"$f":"E14","v":48.136078854817328},7434,11,"250UB31"]
[28.9,313,90.144000000000005,{"$f":"D13","v":68.504314110603673},{"$f":"E13","v":60.213706349680102},6069,10,"250UB26"]
[44.4,391,112.608,{"$f":"D15","v":85.393115835874866},{"$f":"E15","v":73.714350488049661},9324,12,"250UB37"]
[63.2,467,134.49600000000001,{"$f":"D17","v":99.042474845748174},{"$f":"E17","v":69.6665430919073},13272,14,"310UB40"]
[56.6,485,139.68,{"$f":"D16","v":110.02956970845833},{"$f":"E16","v":99.127362322545906},11886,13,"310UB32"]
[85.2,621,178.84800000000001,{"$f":"D18","v":147.12388135883623},{"$f":"E18","v":128.85415846078169},17892,15,"310UB46"]
[121,760,218.88,{"$f":"D20","v":178.87615082967392},{"$f":"E20","v":155.57426055409738},25410,17,"360UB51"]
[99.5,723,208.22399999999999,{"$f":"D19","v":167.14949667080111},{"$f":"E19","v":148.75615472197458},20895,16,"360UB45"]
[142,895,241.65,{"$f":"D21","v":204.98934288178393},180.95146690699653,29820,18,"360UB57"]
[161,1010,272.7,234.78009828882915,208.83268295019431,33810,19,"410UB54"]
[186,1040,299.52,248.05184992444691,216.2245256776832,39060,20,"410UB60"]
[215,1190,321.3,276.99895934550318,245.20084116170892,45150,21,"X"]
[]
[]
[null,null,"Others","Lintel up","Lintel dn",null,null,null,"This data used for lintels under downwards loading (Cases 5-7, 9)"]
["Iex","Zex","fM","faaM","faaM","EI","Index","Size"]
[0,0,0,{"$f":"D4","v":0},{"$f":"E4","v":0},0,1,"150UB14"]
[6.67,102,29.376000000000001,{"$f":"D5","v":14.125482390843006},{"$f":"E5","v":11.997058787567575},1400.7,2,"150UB18"]
[10.6,138,39.744,{"$f":"D7","v":20.839853204448218},{"$f":"E7","v":17.53357677019422},2226,4,"180UB18"]
[9.0500000000000007,135,38.880000000000003,{"$f":"D6","v":21.706798132408874},{"$f":"E6","v":18.860038138384024},1900.5000000000002,3,"180UB16"]
[12.1,157,45.216000000000001,{"$f":"D8","v":25.052073502202429},{"$f":"E8","v":21.344667468522463},2541,5,"180UB22"]
[15.8,180,51.84,{"$f":"D10","v":28.152347640995309},{"$f":"E10","v":23.520126524323512},3318,7,"200UB22"]
[15.3,179,51.552,{"$f":"D9","v":32.95474125050459},{"$f":"E9","v":28.85947218691032},3213,6,"200UB18"]
[21,227,65.376000000000005,{"$f":"D11","v":46.895328719234982},{"$f":"E11","v":40.213419308809996},4410,8,"200UB25"]
[23.6,257,74.016000000000005,{"$f":"D12","v":53.975310795583887},{"$f":"E12","v":46.674101768003744},4956,9,"200UB30"]
[35.4,285,82.08,{"$f":"D14","v":56.544981946255682},{"$f":"E14","v":48.136078854817328},7434,11,"250UB31"]
[28.9,313,90.144000000000005,{"$f":"D13","v":68.504314110603673},{"$f":"E13","v":60.213706349680102},6069,10,"250UB26"]
[63.2,467,134.49600000000001,{"$f":"D17","v":99.042474845748174},{"$f":"E17","v":69.6665430919073},13272,13,"310UB40"]
[44.4,391,112.608,{"$f":"D15","v":85.393115835874866},{"$f":"E15","v":73.714350488049661},9324,12,"250UB37"]
[56.6,485,139.68,{"$f":"D16","v":110.02956970845833},{"$f":"E16","v":99.127362322545906},11886,13,"310UB32"]
[85.2,621,178.84800000000001,{"$f":"D18","v":147.12388135883623},128.85415846078169,17892,15,"310UB46"]
[99.5,723,208.22399999999999,167.14949667080111,148.75615472197458,20895,16,"360UB45"]
[121,760,218.88,178.87615082967392,155.57426055409738,25410,17,"360UB51"]
[142,895,241.65,204.98934288178393,180.95146690699653,29820,18,"360UB57"]
[161,1010,272.7,234.78009828882915,208.83268295019431,33810,19,"410UB54"]
[186,1040,299.52,248.05184992444691,216.2245256776832,39060,20,"410UB60"]
[215,1190,321.3,276.99895934550318,245.20084116170892,45150,21,"X"]

{"sheet":"Flitch","index":5,"n_rows":54,"n_cols":12,"rows_kept":54,"cut":false,"hidden":true,"merged":[]}
["Flitch beams",null,null,null,"Note:  I have offset all properties down 1 row to allow the Vlookup function to pick the correct size in the last column"]
[]
[null,null,null,null,null,null,null,"Assumes restrained at tension edge (NZS 3603)",null,"Used for face load (wind only)"]
["fM (short)","fM (long)","fM xk8","EI(s)","EI(l)","Index","Code","k8",null,"fM (dry)","fM (dry)","EI(s) (dry)"]
[0,0,0,0,0,0,"FB15L",1,"Mitek",1.0616666666666665,6.3722307692307689,12.998066666666666]
[6.3722307692307689,5.4676153846153852,{"$f":"A6*H5","v":6.3722307692307689},322.1516666666667,291.96766666666667,1,"FB20M",1,null,1.4408333333333332,15,18.630933333333331]
[15,12.3,{"$f":"A7*H6","v":15},1115.0608333333332,1039.6118333333332,2,"FB25L",1,null,1.82,15.03,22.196000000000002]
[15.03,12.4,{"$f":"A8*H7","v":15.03},1300.8,1148.7360000000001,3,"FB25M",1,null,1.82,24.923188449848023,23.5456]
[24.923188449848023,22.402094224924014,{"$f":"A9*H8","v":24.923188449848023},2277.7024999999999,2125.6385,4,"FB30M",0.95,null,2.1991666666666672,34.747235714285715,28.460266666666669]
[36.576037593984964,32.908518796992482,{"$f":"A10*H9","v":34.747235714285715},4053.8441666666663,3785.5651666666663,5,"X"]
["Ordered by EI"]
[0,0,0,0,0,0,"FB130/5",1]
[6.2268692307692302,5.0146846153846152,{"$f":"A13*H12","v":6.2268692307692302},314.8028333333333,253.52016666666665,1,"FB130/6",1]
[6.9873692307692306,5.7751846153846174,6.9873692307692306,353.25033333333329,291.96766666666667,2,"FB130/10",1]
[10.02936923076923,8.8171846153846154,10.02936923076923,507.04033333333331,445.75766666666669,3,"FB150/5",1]
[10.314534285714288,7.6885171428571439,10.314534285714288,601.68116666666674,448.49683333333337,4,"FB150/6",1]
[11.327034285714289,8.7010171428571432,11.327034285714289,660.74366666666674,507.55933333333337,5,"FB150/8",1]
[13.352034285714288,10.726017142857142,13.352034285714288,778.86866666666674,625.68433333333337,6,"FB150/10",1]
[15.377034285714288,12.751017142857142,15.377034285714288,896.99366666666674,743.80933333333337,7,"FB180/6",1]
[13.12469523809524,10.93634761904762,13.12469523809524,918.72866666666675,765.54433333333338,8,"FB180/10",1]
[18.956695238095236,16.768347619047621,18.956695238095236,1326.9686666666666,1173.7843333333335,9,"FB200/6",1]
[18.738925714285713,14.769462857142855,18.738925714285713,1457.472,1148.7360000000001,10,"FB200/10",1]
[25.938925714285716,21.969462857142858,25.938925714285716,2017.472,1708.7360000000001,11,"FB250/6",1]
[28.08000342857143,22.477501714285715,28.08000342857143,2730.0003333333329,2185.3126666666667,12,"FB250/10",1]
[39.33000342857143,33.727501714285722,39.33000342857143,3823.7503333333329,3279.0626666666667,13,"x"]
[]
["Ordered by M"]
[0,0,0,0,0,0,"FB130/5",1]
[6.2268692307692302,5.0146846153846152,{"$f":"A29*H28","v":6.2268692307692302},314.8028333333333,253.52016666666665,1,"FB130/6",1]
[6.9873692307692306,5.7751846153846174,6.9873692307692306,353.25033333333329,291.96766666666667,2,"FB130/10",1]
[10.02936923076923,8.8171846153846154,10.02936923076923,507.04033333333331,445.75766666666669,3,"FB150/5",1]
[10.314534285714288,7.6885171428571439,10.314534285714288,601.68116666666674,448.49683333333337,4,"FB150/6",1]
[11.327034285714289,8.7010171428571432,11.327034285714289,660.74366666666674,507.55933333333337,5,"FB180/6",1]
[13.12469523809524,10.93634761904762,13.12469523809524,918.72866666666675,765.54433333333338,8,"FB150/8",1]
[13.352034285714288,10.726017142857142,13.352034285714288,778.86866666666674,625.68433333333337,6,"FB150/10",1]
[15.377034285714288,12.751017142857142,15.377034285714288,896.99366666666674,743.80933333333337,7,"FB200/6",1]
[18.738925714285713,14.769462857142855,18.738925714285713,1457.472,1148.7360000000001,10,"FB180/10",1]
[18.956695238095236,16.768347619047621,18.956695238095236,1326.9686666666666,1173.7843333333335,9,"FB200/10",1]
[25.938925714285716,21.969462857142858,25.938925714285716,2017.472,1708.7360000000001,11,"FB250/6",1]
[28.08000342857143,22.477501714285715,28.08000342857143,2730.0003333333329,2185.3126666666667,12,"FB250/10",1]
[39.33000342857143,33.727501714285722,39.33000342857143,3823.7503333333329,3279.0626666666667,13,"x"]
[]
[]
[0,0,0,0,0,0,"150PF6",1,"Pryda",1.0616666666666665,6.6629722222222236,13.016966666666665]
[6.6629722222222236,5.7918611111111122,{"$f":"A45*H44","v":6.6629722222222236},349.80604166666666,304.07270833333331,1,"200PF6",1,null,1.4408333333333332,12.418665057915058,17.67263333333333]
[12.418665057915058,10.829707528957531,12.418665057915058,893.45395833333339,779.13729166666667,2,"200PF8",1,null,1.4408333333333332,15.498915057915056,18.630933333333331]
[15.498915057915056,13.909957528957529,15.498915057915056,1115.0608333333332,1000.7441666666665,3,"200PF10",1,null,1.4408333333333332,18.579165057915063,20.210833333333333]
[18.579165057915063,16.99020752895753,18.579165057915063,1336.6677083333332,1222.3510416666668,4,"250PF6",1,null,1.82,19.952938449848027,22.328299999999999]
[19.952938449848027,17.431844224924014,19.952938449848027,1823.4768750000001,1593.076875,5,"250PF8",1,null,1.82,24.923188449848023,23.5456]
[24.923188449848023,22.402094224924014,24.923188449848023,2277.7024999999999,2047.3025,6,"250PF10",1,null,1.82,29.893438449848031,25.552499999999998]
[29.893438449848031,27.372344224924014,29.893438449848031,2731.9281250000004,2501.5281250000003,7,"300PF6",0.95,null,2.1991666666666672,27.802498214285713,26.983966666666667]
[29.265787593984964,25.598268796992485,27.802498214285713,3243.6247916666666,2837.1414583333335,8,"300PF8",0.95,null,2.1991666666666672,34.747235714285715,28.460266666666669]
[36.576037593984964,32.908518796992482,34.747235714285715,4053.8441666666663,3647.3608333333336,9,"300PF10",0.95,null,2.1991666666666672,41.69197321428571,30.894166666666667]
[43.88628759398496,40.218768796992471,41.69197321428571,4864.0635416666664,4457.5802083333328,10,"X"]

{"sheet":"Start","index":6,"n_rows":27,"n_cols":6,"rows_kept":27,"cut":false,"hidden":false,"merged":[[16,4,18,9],[13,5,14,9],[3,1,5,9],[25,1,25,9]]}
[]
[null,"Welcome to the BRANZ Lintels and beams calculator"]
[]
[null,"Calculator for selecting sizes and details of lintels and beams and their fixings and supports for various applications.  \nThe calculator is intended for buildings generally within the scope of NZS 3604."]
[]
[]
[]
[null,"How to use the calculator:"]
[]
[null,"Start a new project",null,null,1,"Go to \"Input beam data\" sheet and enter your project details in the \"Project data\" box."]
[null,null,null,null,2,"Choose the wind zone, site elevation and snow region in \"Site information\" box."]
[]
[null,"Input data to design",null,null,3,"Enter your beam reference, then choose the application."]
[null,"a new beam for the project",null,null,4,"To enter beam data specific to your application press the \"Input beam data\" button.  Don’t enter data in the green box, it will automatically update as you go."]
[]
[]
[null,"Print your calculation",null,null,"Once you are satisfied with your design, pressing \"Print\" will take you to a page to print for a Building Consent application.  \nNote:  We no longer offer drawings or a PS1 with these calculations."]
[]
[]
[]
[null,"Download a new spreadsheet for each beam calculation and save as required for your records"]
[]
[]
[null,"Need help?"]
[null,"Lintels and Beams: Engineering basis may answer your (or the BCA's) question. This is available from the following link;"]
[null,"Lintels and Beams: Engineering Basis"]
[null,"Alternatively you can ring the BRANZ helpline on 0800 80 80 85  or  0900 5 90 90"]

{"sheet":"Input beam data","index":7,"n_rows":38,"n_cols":23,"rows_kept":38,"cut":false,"hidden":false,"merged":[[30,10,30,18],[19,13,20,13],[35,17,37,23],[3,3,3,9],[9,1,9,3],[18,12,23,12],[29,0,31,1],[25,0,28,1],[32,0,33,1],[34,0,35,1],[35,10,37,15],[29,10,29,23],[4,3,5,9],[6,3,6,9],[16,10,16,12]]}
["BRANZ Lintels and beams calculator"]
[]
[null,"Project data",null,null,null,null,null,null,null,null,null,null,"Site information"]
[null,null,"Owner's name:","BRANZ",null,null,null,null,null,null,null,null,null,"Wind zone:  "]
[null,null,"Site address:","1222 Moonshine Road"]
[null,null,null,null,null,null,null,null,null,null,null,null,null,"Site elevation:"]
[null,null,"Project reference:","Project reference"]
[null,null,null,null,null,null,null,null,null,null,null,null,null,"Snow region:"]
[null,"Beam reference",null,null,null,null,"Application:  ",null,null,null,null,null,null,"Ground snow load:",{"$f":"CHOOSE('Basic data'!J5,'Basic data'!K7,'Basic data'!K8,'Basic data'!K9,'Basic data'!K10,'Basic data'!K11,'Basic data'!K12)","v":0},"kPa"]
[null,"Beam reference"]
[]
[]
[]
[null,"You have input the following data.   Are they correct?"]
[null,"Beam",null,"Span",3,"metres",null,null,null,"Loaded dimension",2,"metres",null,{"$f":"IF('Basic data'!T5=1,\"Lintel to ceiling\",\"\")","v":"Lintel to ceiling"},400,{"$f":"IF('Basic data'!T5=1,\"mm\",\"\")","v":"mm"},null,null,null,null,"Concentrated loads (kN)"]
[null,null,null,null,3,null,null,null,null,null,2,null,null,null,null,null,null,null,null,null,null,null,"Distance (m)"]
[null,"Roof",null,"Roof weight",{"$f":"IF(OR('Basic data'!T5=5,'Basic data'!T5=6),\"\",VLOOKUP('Basic data'!M5,'Basic data'!G7:L14,6))","v":"Heavy"},null,null,null,null,"Roof slope",{"$f":"IF(OR('Basic data'!T5=5,'Basic data'!T5=6),\"\",VLOOKUP('Basic data'!V5,'Basic data'!W14:X19,2))","v":"10 to 15 degrees"},null,null,null,0.6,{"$f":"IF(OR('Basic data'!T5=1,'Basic data'!T5=2,'Basic data'!T5=3,'Basic data'!T5=4,'Basic data'!T5=7,'Basic data'!T5=8,'Basic data'!T5=9),\"metres\",\"\")","v":"metres"},null,null,null,null,null,null,"Dead load"]
[null,null,null,null,null,null,null,null,null,null,null,null,null,null,0.6,null,null,null,null,null,null,null,"Live load"]
[null,"Wall",null,null,"Weight of supported wall",{"$f":"IF(OR('Basic data'!T5=2,'Basic data'!T5=3),VLOOKUP('Basic data'!O5,'Basic data'!G7:U14,8),\"\")","v":""},null,null,null,"Height of supported wall",{"$f":"IF(OR('Basic data'!T5=2,'Basic data'!T5=3),VLOOKUP('Basic data'!Y5,'Basic data'!G7:Y14,19),\"\")","v":""},{"$f":"IF(OR('Basic data'!T5=2,'Basic data'!T5=3),\"metres\",\"\")","v":""},{"$f":"IF('Basic data'!T5=9,\"Cantilever data\",\"\")","v":""},{"$f":"IF('Basic data'!T5=9,IF(Calc!P113=2,\"Cantilever span 2\",\"Supported span\"),\"\")","v":""},null,{"$f":"IF('Basic data'!T5=9,\"metres\",\"\")","v":""},null,null,null,null,null,null,"up Wind"]
[null,null,null,null,null,null,null,null,null,null,null,null,null,{"$f":"IF('Basic data'!T5=9,IF(OR(Calc!P113=1,Calc!P113=2,Calc!P113=3),\"\",\"LD of \nsupported span\"),\"\")","v":""},null,null,null,null,null,null,null,null,"down Wind"]
[null,"Floor",null,"Floor (or deck) load",{"$f":"IF(OR('Basic data'!T5=3,'Basic data'!T5=5,'Basic data'!T5=6),VLOOKUP('Basic data'!Q5,'Basic data'!G7:Q9,11),\"\")","v":""},{"$f":"IF(OR('Basic data'!T5=3,'Basic data'!T5=5,'Basic data'!T5=6),\"kPa\",\"\")","v":""},null,null,null,"LD of intermediate floor",3,{"$f":"IF('Basic data'!T5=3,\"metres\",\"\")","v":""},null,null,null,{"$f":"IF(AND(Calc!P113=4,'Basic data'!T5=9),\"metres\",\"\")","v":""},null,null,null,null,null,null,"Snow load"]
[null,null,null,{"$f":"IF('Basic data'!T5=6,\"Deck height above ground\",\"\")","v":""},"<3m",null,null,null,null,null,3]
[null,null,null,null,null,null,null,null,null,null,null,null,null,{"$f":"IF('Basic data'!T5=9,\"Back span\",\"\")","v":""},null,{"$f":"IF('Basic data'!T5=9,\"metres\",\"\")","v":""},null,null,null,null,null,null,"Total"]
["Beam options for this application:",null,null,null,null,null,null,"Choose a beam option:",null,null,null,null,null,{"$f":"IF('Basic data'!T5=9,\"Configuration\",\"\")","v":""},null,{"$f":"IF('Basic data'!T5=9,IF(OR(Configuration=1,Configuration=2),\"(Hip roof)\",\"(Gable roof)\"),\"\")","v":""}]
[]
["Timber \n(VSG/MSG8)",null,{"$f":"IF(Results!B6=\"X\",\"Not possible in a single 45mm thick timber\",Results!B6)","v":"290x45"},null,null,null,null,"Support required for your chosen option:"]
[null,null,{"$f":"IF(Results!B7=\"X\",\"Not possible in 70mm thick timber\",Results!B7)","v":"290x70"},null,null,null,null,null,"End 1",null,null,null,{"$f":"Results!I38","v":"Single prop stud (90x45)"}]
[null,null,{"$f":"IF(Results!B8=\"X\",\"Not possible in 2/45mm thick timber\",Results!B8)","v":"2/240x45"},null,null,null,null,null,"End 2",null,null,null,{"$f":"Results!I48","v":"Single prop stud (90x45)"}]
[null,null,{"$f":"IF(Results!B9=\"X\",\"Not possible in 90mm thick timber\",Results!B9)","v":"240x90"},null,null,null,null,"Beam end fixing required for your chosen option:"]
["LVL\n(Laminated veneer lumber)",null,{"$f":"IF(Results!B10=\"X\",\"Not possible in 45mm thick LVL\",IF(Results!B10=\"NA\",\"LVL not suitable for exposed situation\",Results!B10))","v":"240 x45"},null,null,null,null,null,"End 1",null,{"$f":"Results!S38","v":"25x0.9 mm nail strap with 6/30x3.15 nails (see Figure 8.12 NZS 3604)"}]
[null,null,{"$f":"IF(Results!B11=\"X\",\"Not possible in 63mm thick LVL\",IF(Results!B11=\"NA\",\"\",Results!B11))","v":"200x63"},null,null,null,null,null,"End 2",null,{"$f":"Results!S48","v":"25x0.9 mm nail strap with 6/30x3.15 nails (see Figure 8.12 NZS 3604)"}]
[null,null,{"$f":"IF(Results!B12=\"X\",\"Not possible in 90mm thick LVL\",IF(Results!B12=\"NA\",\"\",Results!B12))","v":"200x90"},null,null,null,null,"Choose the most appropriate foundation type for your situation:"]
["Glulam \n(GL8)",null,{"$f":"IF(Results!B13=\"X\",\"Not possible in 65mm thick Glulam\",IF(Results!B13=\"NA\",\"Glulam not suitable for exposed situation\",Results!B13))","v":"225x65"},null,null,null,null,null,"End 1",null,null,null,null,null,"End 2"]
[null,null,{"$f":"IF(Results!B14=\"X\",\"Not possible in 90mm thick Glulam\",IF(Results!B14=\"NA\",\"\",Results!B14))","v":"225x90"}]
["Hot rolled steel",null,{"$f":"IF(Results!B15=\"NA\",\"Steel in exposed situations, requires SED\",Results!B15)","v":"150UB14"},null,null,null,null,null,null,"Foundation required:","End 1",{"$f":"IF(OR(Results!AB4=1,Results!AB4=5),IF(Results!AC32>Results!AC28,Results!AD32,Results!AD28),IF(Results!AB4=2,\"Min. of  \"&MAX(Results!AC33,Results!AC29)&\" m of foundation wall, at least 165mm wide\",IF(Results!AB4=3,\"Min. of  \"&MAX(Results!AC34,Results!AC29)&\" lineal metres of slab edging\",IF(Results!AB4=4,Results!AD35,Results!AD36))))","v":"Min. of  1.1 lineal metres of slab edging"},null,null,null,"End 2",{"$f":"IF(OR(Results!AB5=1,Results!AB5=5),IF(Results!AC32>Results!AC28,Results!AD32,Results!AD28),IF(Results!AB5=2,\"Min. of  \"&MAX(Results!AC33,Results!AC29)&\" m of foundation wall, at least 165mm wide\",IF(Results!AB5=3,\"Min. of  \"&MAX(Results!AC34,Results!AC29)&\" lineal metres of slab edging\",IF(Results!AB5=4,Results!AD35,Results!AD36))))","v":"Min. of  1.1 lineal metres of slab edging"}]
[null,null,{"$f":"IF(Results!B16=\"NA\",\"Steel in exposed situations, requires SED\",Results!B16)","v":"100PFC"},null,null,null,null,null,null,"Fixing to foundation:",{"$f":"Results!AB38","v":"25x0.9 mm nail strap folded under plate, with 6/30x3.15 nails each side of stud (see Figure 8.12 NZS 3604), 15kN bolt, plate to slab"},null,null,null,null,null,null,{"$f":"Results!AB52","v":"25x0.9 mm nail strap folded under plate, with 6/30x3.15 nails each side of stud (see Figure 8.12 NZS 3604), 15kN bolt, plate to slab"}]
["Flitch beam",null,{"$f":"IF(OR('Basic data'!T5=4,'Basic data'!T5=6),\"Flitch beam not suitable for exposed situation\",IF(Results!B17=\"X\",\"Not possible with a Mitek flitch beam\",IF(Span>6,Results!B17&\" (check length availability)\",Results!B17)))","v":"FB15L"},null,null,null,null,null,null,"End 1",null,null,null,null,null,null,"End 2"]
[null,null,{"$f":"IF(OR('Basic data'!T5=4,'Basic data'!T5=6),\"\",IF(Results!B18=\"X\",\"Not possible with a Pryda flitch beam\",IF(Span>6,Results!B18&\" (check length availability)\",Results!B18)))","v":"150PF6"}]

{"sheet":"Print","index":8,"n_rows":73,"n_cols":8,"rows_kept":73,"cut":false,"hidden":false,"merged":[[40,1,41,1],[49,2,49,8],[65,2,65,8],[67,2,67,8],[56,2,56,8],[54,2,54,8],[50,2,51,8],[59,5,60,8],[59,2,60,4],[61,2,63,8],[10,2,10,3],[40,2,40,3],[40,4,40,5],[14,2,15,5],[72,2,74,8],[70,5,71,8],[70,2,71,4]]}
[]
[null,"BRANZ Lintels and Beams Calculator"]
[]
[]
[null,"Project information"]
[]
[null,"Owner's name",{"$f":"'Input beam data'!D4","v":"BRANZ"}]
[]
[null,"Project reference",{"$f":"'Input beam data'!D7","v":"Project reference"}]
[null,"Calculated by","R Shelton"]
[null,"Calc. date","2020-06-20"]
[]
[null,"Site information"]
[]
[null,"Site address:",{"$f":"'Input beam data'!D5","v":"1222 Moonshine Road"}]
[]
[null,"Wind zone:",{"$f":"VLOOKUP('Basic data'!I5,'Basic data'!G7:Y14,2)","v":"High"},null,"Site elevation:",{"$f":"INDEX('Basic data'!T18:T26,'Basic data'!U17,1)","v":"< 100m"}]
[null,"Snow load:",{"$f":"'Input beam data'!O9","v":0},"kPa"]
[]
[null,"Beam data"]
[]
[null,"Beam reference",{"$f":"'Input beam data'!B10","v":"Beam reference"}]
[]
[null,"Application:",{"$f":"VLOOKUP('Basic data'!T5,'Basic data'!G7:Y15,14)","v":"Lintel, roof only"},null,null,{"$f":"IF('Basic data'!T5=9,\"Configuration:\",\"\")","v":""},{"$f":"IF('Basic data'!T5=9,Configuration,\"\")","v":""},{"$f":"IF('Basic data'!T5=9,IF(OR(Configuration=1,Configuration=2),\"(Hip roof)\",\"(Gable roof)\"),\"\")","v":""}]
[null,{"$f":"'Input beam data'!D15&\":\"","v":"Span:"},{"$f":"'Input beam data'!E15","v":3},"metres",null,{"$f":"IF(OR('Basic data'!T5=1,'Basic data'!T5=2,'Basic data'!T5=3,'Basic data'!T5=4,'Basic data'!T5=7,'Basic data'!T5=8,'Basic data'!T5=9),\"Roof weight:\",\"\")","v":"Roof weight:"},{"$f":"IF(OR('Basic data'!T5=1,'Basic data'!T5=2,'Basic data'!T5=3,'Basic data'!T5=4,'Basic data'!T5=7,'Basic data'!T5=8,'Basic data'!T5=9),VLOOKUP('Basic data'!M5,'Basic data'!G7:L14,6),\"\")","v":"Heavy"}]
[null,"Loaded dimension:",{"$f":"IF(AND('Basic data'!T5=9,OR(Configuration=1,Configuration=2)),\"No LD for hip roof\",IF(AND('Basic data'!T5=9,Configuration=4),LDcant,LD))","v":2},"metres",null,{"$f":"IF(OR('Basic data'!T5=1,'Basic data'!T5=2,'Basic data'!T5=3,'Basic data'!T5=4,'Basic data'!T5=7,'Basic data'!T5=8,'Basic data'!T5=9),\"Roof slope:\",\"\")","v":"Roof slope:"},{"$f":"'Input beam data'!K17","v":"10 to 15 degrees"}]
[null,{"$f":"IF('Basic data'!T5=3,\"LD of floor:\",IF('Basic data'!T5=9,'Input beam data'!N19,\"\"))","v":""},{"$f":"IF('Basic data'!T5=3,\"LD of floor:\",IF('Basic data'!T5=9,'Input beam data'!O19,\"\"))","v":""},{"$f":"IF(OR('Basic data'!T5=3,'Basic data'!T5=9),\"metres\",\"\")","v":""},null,{"$f":"IF(OR('Basic data'!T5=2,'Basic data'!T5=3),\"Weight of supported wall:\",\"\")","v":""},{"$f":"IF(OR('Basic data'!T5=2,'Basic data'!T5=3),VLOOKUP('Basic data'!O5,'Basic data'!G7:U14,8),\"\")","v":""}]
[null,{"$f":"IF(OR('Basic data'!T5=1,'Basic data'!T5=2,'Basic data'!T5=3,'Basic data'!T5=4,'Basic data'!T5=7,'Basic data'!T5=8,'Basic data'!T5=9),\"Roof overhang:\",\"\")","v":"Roof overhang:"},{"$f":"IF(OR('Basic data'!T5=1,'Basic data'!T5=2,'Basic data'!T5=3,'Basic data'!T5=4,'Basic data'!T5=7,'Basic data'!T5=8,'Basic data'!T5=9),'Input beam data'!O17,\"\")","v":0.6},{"$f":"IF(OR('Basic data'!T5=1,'Basic data'!T5=2,'Basic data'!T5=3,'Basic data'!T5=4,'Basic data'!T5=7,'Basic data'!T5=8,'Basic data'!T5=9),\"metres\",\"\")","v":"metres"},null,{"$f":"IF(OR('Basic data'!T5=2,'Basic data'!T5=3),\"Height of supported wall:\",\"\")","v":""},{"$f":"IF(OR('Basic data'!T5=2,'Basic data'!T5=3),VLOOKUP('Basic data'!Y5,'Basic data'!G7:Y14,19),\"\")","v":""},{"$f":"IF(OR('Basic data'!T5=2,'Basic data'!T5=3),\"metres\",\"\")","v":""}]
[null,{"$f":"IF(OR('Basic data'!T5=3,'Basic data'!T5=5),\"Floor load:\",\"\")","v":""},{"$f":"IF(OR('Basic data'!T5=3,'Basic data'!T5=5),VLOOKUP('Basic data'!Q5,'Basic data'!G7:Q9,11),\"\")","v":""},{"$f":"IF(OR('Basic data'!T5=3,'Basic data'!T5=5),\"kPa\",\"\")","v":""},null,{"$f":"IF('Basic data'!T5=9,\"Back span:\",\"\")","v":""},{"$f":"IF('Basic data'!T5=9,BSpan,\"\")","v":""},{"$f":"IF('Basic data'!T5=9,\"metres\",\"\")","v":""}]
[]
[null,"Calculation"]
[]
[null,null,"ULS",null,"SLS (short term loading)"]
[null,{"$f":"IF('Basic data'!T5=9,\"Total load\",\"Distributed load\")","v":"Distributed load"},{"$f":"MAX(Results!B31:B35,ABS(Results!B34))","v":4.2535524304475407},{"$f":"IF('Basic data'!T5=9,\"kN\",\"kN/m\")","v":"kN/m"},{"$f":"MAX(Results!B27:B30)","v":2.7429603587062834},{"$f":"IF('Basic data'!T5=9,\"kN\",\"kN/m\")","v":"kN/m"}]
[null,"Concentrated load:",{"$f":"IF('Basic data'!T5=9,\"NA\",MAX(Results!AG30:AG34,ABS(Results!AG33)))","v":0},"kN",{"$f":"IF('Basic data'!T5=9,\"NA\",IF(OR(TotalLoad=0, TotalLoad=\"\"),MAX(Results!AG26:AG29),\"-\"))","v":0},"kN"]
[null,"M*:",{"$f":"Results!B38","v":4.7852464842534834},"kNm"]
[null,"V*:",{"$f":"Results!B39","v":6.3803286456713106},"kN"]
[]
[null,"Uplift force:",{"$f":"Results!F34","v":3.7579178203363131},"kN"]
[]
[null,"Deflection for\nchosen option:","      (long term)",null,"     (short term)"]
[null,null,{"$f":"Results!D27","v":86.715698726477214},"mm",{"$f":"Results!D28","v":51.980298342830437},"mm"]
[null,null,"(=span/",{"$f":"INT('Input beam data'!E15*1000/Print!C42)&\")\"","v":"34)"},"(=span/",{"$f":"INT('Input beam data'!E15*1000/Print!E42)&\")\"","v":"57)"}]
[null,"(Beam details on second sheet)"]
[]
[null,"Beam and support details"]
[]
[null,"Chosen option:  ",{"$f":"VLOOKUP(Results!C20,Results!C6:E18,3)","v":"140x45  VSG/MSG8 (SG8)"}]
[null,null,{"$f":"IF(LEFT(Results!D20,1)=\"F\",'Basic data'!A52,IF(AND(MID(Results!D20,4,1)=\"P\",MID(Results!D20,6,3)<>\"C\"),'Basic data'!A53,\"\"))","v":""}]
[null,"Treatment:  ",{"$f":"IF(OR(MID(Results!$D$20,4,1)=\"U\",MID(Results!$D$20,4,3)=\"PFC\"),IF(OR('Basic data'!T5=6,'Basic data'!T5=4),'Basic data'!B47,'Basic data'!B46),IF('Basic data'!T5=6,'Basic data'!B45,'Basic data'!B44))","v":"Timber beam treated to H1.2"}]
[null,"Fixing durability:  ",{"$f":"'Basic data'!$B$43","v":"Refer to Tables 4.1, 4.2 and 4.3 in the current NZS 3604 to determine suitable fixing types for the building location and B2 Durability requirements"}]
[]
[]
[null,"End 1"]
[null,"End support:  ",{"$f":"'Input beam data'!$M$27","v":"Single prop stud (90x45)"}]
[]
[null,"End fixing:  ",{"$f":"'Input beam data'!K30","v":"25x0.9 mm nail strap with 6/30x3.15 nails (see Figure 8.12 NZS 3604)"}]
[]
[null,"Foundation:  ",{"$f":"Results!AA6","v":"Concrete slab edging (NZS3604)"}]
[null,"Size:  ",{"$f":"'Input beam data'!L35","v":"Min. of  1.1 lineal metres of slab edging"},null,null,{"$f":"IF('Basic data'!T5=4,\"Double concrete volume for double span veranda beam continuous over post\",\"\")","v":""}]
[]
[null,"Foundation fixing:  ",{"$f":"'Input beam data'!K36","v":"25x0.9 mm nail strap folded under plate, with 6/30x3.15 nails each side of stud (see Figure 8.12 NZS 3604), 15kN bolt, plate to slab"}]
[]
[]
[null,"End 2"]
[null,"End support:  ",{"$f":"'Input beam data'!$M$28","v":"Single prop stud (90x45)"}]
[]
[null,"End fixing:  ",{"$f":"'Input beam data'!K31","v":"25x0.9 mm nail strap with 6/30x3.15 nails (see Figure 8.12 NZS 3604)"}]
[]
[null,"Foundation:  ",{"$f":"Results!AA7","v":"Concrete slab edging (NZS3604)"}]
[null,"Size:  ",{"$f":"'Input beam data'!Q35","v":"Min. of  1.1 lineal metres of slab edging"},null,null,{"$f":"IF('Basic data'!T5=4,\"Double concrete volume for veranda beam continuous over post\",\"\")","v":""}]
[]
[null,"Foundation fixing:  ",{"$f":"'Input beam data'!R36","v":"25x0.9 mm nail strap folded under plate, with 6/30x3.15 nails each side of stud (see Figure 8.12 NZS 3604), 15kN bolt, plate to slab"}]

{"sheet":"Calc","index":9,"n_rows":126,"n_cols":53,"rows_kept":126,"cut":false,"hidden":true,"merged":[[1,36,1,37],[2,36,2,37],[101,31,101,32],[115,31,115,32],[114,2,114,7],[114,10,114,13],[114,33,114,34],[45,31,45,32],[30,2,30,7],[30,33,30,34],[44,2,44,7],[44,10,44,13],[44,33,44,34],[59,31,59,32],[73,31,73,32],[87,31,87,32],[31,31,31,32],[62,35,62,37],[2,2,2,7],[2,33,2,34],[16,2,16,7],[16,33,16,34],[30,10,30,13],[16,10,16,13],[2,10,2,13],[3,31,3,32],[17,31,17,32],[100,2,100,7],[100,10,100,13],[100,33,100,34],[58,2,58,7],[58,10,58,13],[58,33,58,34],[72,2,72,7],[72,10,72,13],[72,33,72,34],[86,2,86,7],[86,10,86,13],[86,33,86,34]]}
["Application 1.  Roof only",null,null,null,null,null,null,"(dry props)",null,null,null,"Note: ",null,null,null,null,null,null,null,null,null,"= critical load case"]
[null,null,"Basic loads",null,null,null,null,null,null,null,null,null,null,null,"Note have ignored ceiling on the horizontal plane for now",null,null,null,null,null,null,null,null,null,null,null,null,null,null,null,null,null,null,null,null,null,"Req. bearing area"]
[null,null,"Roof",null,null,null,null,null,"Upper wall","Lower wall","Floor/deck",null,null,null,"Actions",null,null,null,null,null,"Size index's",null,null,null,null,null,null,null,null,null,null,null,null,"Deflection limits",null,"Strength","(mm2)"]
["Load case",null,"G","Ql","Qs","S","W(e)","W(r)","G","G","G","Ql","Qs","S","UDL","P","M*","V*","EI(s)","EI(a)","MSG8",null,null,null,"LVL",null,null,"GL",null,"UB","MSC","Flitch",null,"(span/)","(mm)","dur. fact.","para","perp"]
[1,"G+Ql",{"$f":"VLOOKUP('Basic data'!M$5,'Basic data'!$G$7:$Y$14,7)","v":0.85},0,null,null,null,null,null,null,null,null,null,null,{"$f":"('Input beam data'!$K$15+'Input beam data'!$O$17)*(C5/VLOOKUP('Basic data'!V$5,'Basic data'!$G$7:$Y$14,16)+D5)","v":2.2879603587062833},{"$f":"IF('Input beam data'!X$23=0,'Input beam data'!X$17,'Input beam data'!X$23)","v":0},null,null,{"$f":"(0.013*O5*Span^3+0.0298*P5*Span^2*(3*MIN('Input beam data'!X$16,Span-'Input beam data'!X$16)/Span-4*(MIN('Input beam data'!X$16,Span-'Input beam data'!X$16)/Span)^3))*AH5","v":240.92222577177159},{"$f":"(0.013*O5*Span^4+0.0208*P5*Span^3*(3*MIN('Input beam data'!X$16,Span-'Input beam data'!X$16)/Span-4*(MIN('Input beam data'!X$16,Span-'Input beam data'!X$16)/Span)^3))/(AI5/1000)","v":200.76852147647634},{"$f":"VLOOKUP(MAX(S5:T5),VSGMSG8!G$5:I$11,2)","v":5},{"$f":"VLOOKUP(MAX(S5:T5),VSGMSG8!G$12:I$17,2)","v":4},{"$f":"VLOOKUP(MAX(S5:T5),VSGMSG8!G$18:I$23,2)","v":3},{"$f":"VLOOKUP(MAX(S5:T5),VSGMSG8!G$24:I$29,2)","v":3},{"$f":"VLOOKUP(MAX(S5:T5),LVL!D$5:F$14,2)","v":5},{"$f":"VLOOKUP(MAX(S5:T5),LVL!D$15:F$26,2)","v":4},{"$f":"VLOOKUP(MAX(S5:T5),LVL!D$27:F$33,2)","v":1},{"$f":"VLOOKUP(MAX(S5:T5),Glulam!C$5:E$11,2)","v":2},{"$f":"VLOOKUP(MAX(S5:T5),Glulam!C$12:E$20,2)","v":2},{"$f":"VLOOKUP(MAX(S5:T5),Steel!$F$4:$H$24,2)","v":1},{"$f":"VLOOKUP(MAX(S5:T5),Steel!$F$26:$H$35,2)","v":1},{"$f":"VLOOKUP(MAX(S5:T5),Flitch!$E$5:$F$10,2)","v":0},{"$f":"VLOOKUP(MAX(S5:T5),Flitch!E$44:F$54,2)","v":0},300,12]
[2,"G+Qs",{"$f":"VLOOKUP('Basic data'!M$5,'Basic data'!$G$7:$Y$14,7)","v":0.85},null,{"$f":"0.7*'Basic data'!$M$11","v":0.17499999999999999},null,null,null,null,null,null,null,null,null,{"$f":"('Input beam data'!$K$15+'Input beam data'!$O$17)*(C6/VLOOKUP('Basic data'!V$5,'Basic data'!$G$7:$Y$14,16)+E6)","v":2.7429603587062834},{"$f":"IF('Input beam data'!X$23=0,'Input beam data'!X$17+0.7*'Input beam data'!X$18,'Input beam data'!X$23)","v":0},null,null,{"$f":"(0.013*O6*Span^3+0.0298*P6*Span^2*(3*MIN('Input beam data'!X$16,Span-'Input beam data'!X$16)/Span-4*(MIN('Input beam data'!X$16,Span-'Input beam data'!X$16)/Span)^3))*AH6","v":288.83372577177158},{"$f":"(0.013*O6*Span^4+0.0208*P6*Span^3*(3*MIN('Input beam data'!X$16,Span-'Input beam data'!X$16)/Span-4*(MIN('Input beam data'!X$16,Span-'Input beam data'!X$16)/Span)^3))/(AI6/1000)","v":240.69477147647632},{"$f":"VLOOKUP(MAX(S6:T6),VSGMSG8!E$5:I$11,4)","v":5},{"$f":"VLOOKUP(MAX(S6:T6),VSGMSG8!E$12:I$17,4)","v":3},{"$f":"VLOOKUP(MAX(S6:T6),VSGMSG8!E$18:I$23,4)","v":2},{"$f":"VLOOKUP(MAX(S6:T6),VSGMSG8!E$24:I$29,4)","v":3},{"$f":"VLOOKUP(MAX(S6:T6),LVL!C$5:F$14,3)","v":4},{"$f":"VLOOKUP(MAX(S6:T6),LVL!C$15:F$26,3)","v":4},{"$f":"VLOOKUP(MAX(S6:T6),LVL!C$27:F$33,3)","v":1},{"$f":"VLOOKUP(MAX(S6:T6),Glulam!B$5:E$11,3)","v":2},{"$f":"VLOOKUP(MAX(S6:T6),Glulam!B$12:E$20,3)","v":1},{"$f":"VLOOKUP(MAX(S6:T6),Steel!$F$4:$H$24,2)","v":1},{"$f":"VLOOKUP(MAX(S6:T6),Steel!$F$26:$H$35,2)","v":1},{"$f":"VLOOKUP(MAX(S6:T6),Flitch!$D$5:$F$10,3)","v":0},{"$f":"VLOOKUP(MAX(S6:T6),Flitch!$D$44:$F$54,3)","v":0},300,12]
[3,"Spare"]
[4,"G+S",{"$f":"VLOOKUP('Basic data'!M$5,'Basic data'!$G$7:$Y$14,7)","v":0.85},null,0,{"$f":"0.68*'Input beam data'!$O$9*VLOOKUP('Basic data'!$V$5,'Basic data'!$G$7:$Y$14,17)","v":0},null,null,null,null,null,null,null,null,{"$f":"('Input beam data'!$K$15+'Input beam data'!$O$17)*(C8/VLOOKUP('Basic data'!V$5,'Basic data'!$G$7:$Y$14,16)+F8)","v":2.2879603587062833},{"$f":"IF('Input beam data'!X$23=0,'Input beam data'!X$17+'Input beam data'!X$21,'Input beam data'!X$23)","v":0},null,null,{"$f":"(0.013*O8*Span^3+0.0298*P8*Span^2*(3*MIN('Input beam data'!X$16,Span-'Input beam data'!X$16)/Span-4*(MIN('Input beam data'!X$16,Span-'Input beam data'!X$16)/Span)^3))*AH8","v":240.92222577177159},{"$f":"(0.013*O8*Span^4+0.0208*P8*Span^3*(3*MIN('Input beam data'!X$16,Span-'Input beam data'!X$16)/Span-4*(MIN('Input beam data'!X$16,Span-'Input beam data'!X$16)/Span)^3))/(AI8/1000)","v":200.76852147647634},{"$f":"VLOOKUP(MAX(S8:T8),VSGMSG8!E$5:I$11,4)","v":4},{"$f":"VLOOKUP(MAX(S8:T8),VSGMSG8!E$12:I$17,4)","v":3},{"$f":"VLOOKUP(MAX(S8:T8),VSGMSG8!E$18:I$23,4)","v":2},{"$f":"VLOOKUP(MAX(S8:T8),VSGMSG8!E$24:I$29,4)","v":2},{"$f":"VLOOKUP(MAX(S8:T8),LVL!C$5:F$14,3)","v":4},{"$f":"VLOOKUP(MAX(S8:T8),LVL!C$15:F$26,3)","v":3},{"$f":"VLOOKUP(MAX(S8:T8),LVL!C$27:F$33,3)","v":1},{"$f":"VLOOKUP(MAX(S8:T8),Glulam!B$5:E$11,3)","v":1},{"$f":"VLOOKUP(MAX(S8:T8),Glulam!B$12:E$20,3)","v":1},{"$f":"VLOOKUP(MAX(S8:T8),Steel!$F$4:$H$24,2)","v":1},{"$f":"VLOOKUP(MAX(S8:T8),Steel!$F$26:$H$35,2)","v":1},{"$f":"VLOOKUP(MAX(S8:T8),Flitch!$D$5:$F$10,3)","v":0},{"$f":"VLOOKUP(MAX(S8:T8),Flitch!$D$44:$F$54,3)","v":0},300,12]
[5,"1.35G",{"$f":"VLOOKUP('Basic data'!M$5,'Basic data'!$G$7:$Y$14,7)","v":0.85},null,null,null,null,null,null,null,null,null,null,null,{"$f":"('Input beam data'!$K$15+'Input beam data'!$O$17)*(1.35*C9/VLOOKUP('Basic data'!V$5,'Basic data'!$G$7:$Y$14,16))","v":3.0887464842534826},{"$f":"IF('Input beam data'!X$23=0,1.35*'Input beam data'!X$17,'Input beam data'!X$23)","v":0},{"$f":"MAX(O9*Span^2/8+P9*MIN('Input beam data'!X$16,(Span-'Input beam data'!X$16))/2,P9*'Input beam data'!X$16*(Span-'Input beam data'!X$16)/Span+O9*Span*MIN('Input beam data'!X$16,(Span-'Input beam data'!X$16))/2*(1-MIN('Input beam data'!X$16,(Span-'Input beam data'!X$16))/Span))","v":3.4748397947851681},{"$f":"O9*'Input beam data'!$E$15/2+P9*MAX('Input beam data'!X$16,(Span-'Input beam data'!X$16))/Span","v":4.6331197263802242},null,null,{"$f":"VLOOKUP((Q9/AJ9),VSGMSG8!$B$5:$I$11,7)","v":5},{"$f":"VLOOKUP((Q9/AJ9),VSGMSG8!$B$12:$I$17,7)","v":3},{"$f":"VLOOKUP((Q9/AJ9),VSGMSG8!$B$18:$I$23,7)","v":2},{"$f":"VLOOKUP((Q9/AJ9),VSGMSG8!$B$24:$I$29,7)","v":2},{"$f":"VLOOKUP((Q9/AJ9),LVL!A$5:F$14,5)","v":4},{"$f":"VLOOKUP((Q9/AJ9),LVL!A$15:F$26,5)","v":3},{"$f":"VLOOKUP((Q9/AJ9),LVL!A$27:F$33,5)","v":0},{"$f":"VLOOKUP((Q9/AJ9),Glulam!$A$5:$D$20,4)","v":1},{"$f":"VLOOKUP((Q9/AJ9),Glulam!$A$12:$D$20,4)","v":1},{"$f":"VLOOKUP(Q9,Steel!$E$64:$G$84,3)","v":1},{"$f":"VLOOKUP(Q9,Steel!$E$26:$G$35,3)","v":1},{"$f":"VLOOKUP(Q9,Flitch!$B$5:$F$10,5)","v":0},{"$f":"VLOOKUP(Q9,Flitch!$B$44:$F$54,5)","v":0},null,null,0.6,{"$f":"$R9*1000/'Basic data'!I$21","v":257.3955403544569},{"$f":"$R9*1000/'Basic data'!J$21","v":520.57525015508133}]
[6,"1.2G+1.5Q",{"$f":"VLOOKUP('Basic data'!M$5,'Basic data'!$G$7:$Y$14,7)","v":0.85},null,{"$f":"'Basic data'!M$11","v":0.25},null,null,null,null,{"$f":"1/48","v":2.0833333333333332E-2},null,null,null,null,{"$f":"('Input beam data'!$K$15+'Input beam data'!$O$17)*(1.2*C10/VLOOKUP('Basic data'!V$5,'Basic data'!$G$7:$Y$14,16)+1.5*E10)","v":3.7205524304475399},{"$f":"IF('Input beam data'!X$23=0,1.2*'Input beam data'!X$17+1.5*'Input beam data'!X$18,'Input beam data'!X$23)","v":0},{"$f":"MAX(O10*Span^2/8+P10*MIN('Input beam data'!X$16,(Span-'Input beam data'!X$16))/2,P10*'Input beam data'!X$16*(Span-'Input beam data'!X$16)/Span+O10*Span*MIN('Input beam data'!X$16,(Span-'Input beam data'!X$16))/2*(1-MIN('Input beam data'!X$16,(Span-'Input beam data'!X$16))/Span))","v":4.185621484253482},{"$f":"O10*'Input beam data'!$E$15/2+P10*MAX('Input beam data'!X$16,(Span-'Input beam data'!X$16))/Span","v":5.5808286456713097},null,null,{"$f":"VLOOKUP((Q10/AJ10),VSGMSG8!$B$5:$I$11,7)","v":5},{"$f":"VLOOKUP((Q10/AJ10),VSGMSG8!$B$12:$I$17,7)","v":3},{"$f":"VLOOKUP((Q10/AJ10),VSGMSG8!$B$18:$I$23,7)","v":2},{"$f":"VLOOKUP((Q10/AJ10),VSGMSG8!$B$24:$I$29,7)","v":2},{"$f":"VLOOKUP((Q10/AJ10),LVL!A$5:F$14,5)","v":4},{"$f":"VLOOKUP((Q10/AJ10),LVL!A$15:F$26,5)","v":3},{"$f":"VLOOKUP((Q10/AJ10),LVL!A$27:F$33,5)","v":0},{"$f":"VLOOKUP((Q10/AJ10),Glulam!$A$5:$D$20,4)","v":1},{"$f":"VLOOKUP((Q10/AJ10),Glulam!$A$12:$D$20,4)","v":1},{"$f":"VLOOKUP(Q10,Steel!$E$64:$G$84,3)","v":1},{"$f":"VLOOKUP(Q10,Steel!$E$26:$G$35,3)","v":1},{"$f":"VLOOKUP(Q10,Flitch!$A$5:$F$10,6)","v":0},{"$f":"VLOOKUP(Q10,Flitch!$A$44:$F$54,6)","v":0},null,null,0.8,{"$f":"$R10*1000/'Basic data'!I$21","v":310.04603587062832},{"$f":"$R10*1000/'Basic data'!J$21","v":627.05939839003474}]
[7,"1.2G+yQ+W",{"$f":"VLOOKUP('Basic data'!M$5,'Basic data'!$G$7:$Y$14,7)","v":0.85},null,0,null,{"$f":"VLOOKUP('Basic data'!I$5,'Basic data'!$G$7:$Y$14,3)*'Basic data'!E$19*'Basic data'!F$19*'Basic data'!G$19","v":0.57999999999999996},{"$f":"VLOOKUP('Basic data'!I$5,'Basic data'!$G$7:$Y$14,3)*'Basic data'!E$19*'Basic data'!F$19*'Basic data'!G$19","v":0.57999999999999996},null,null,null,null,null,null,{"$f":"('Input beam data'!$K$15+'Input beam data'!$O$17)*(1.2*C11/VLOOKUP('Basic data'!V$5,'Basic data'!$G$7:$Y$14,16)+H11)","v":4.2535524304475407},{"$f":"IF('Input beam data'!X$23=0,1.2*'Input beam data'!X$17+0+'Input beam data'!X$20,'Input beam data'!X$23)","v":0},{"$f":"MAX(O11*Span^2/8+P11*MIN('Input beam data'!X$16,(Span-'Input beam data'!X$16))/2,P11*'Input beam data'!X$16*(Span-'Input beam data'!X$16)/Span+O11*Span*MIN('Input beam data'!X$16,(Span-'Input beam data'!X$16))/2*(1-MIN('Input beam data'!X$16,(Span-'Input beam data'!X$16))/Span))","v":4.7852464842534834},{"$f":"O11*'Input beam data'!$E$15/2+P11*MAX('Input beam data'!X$16,(Span-'Input beam data'!X$16))/Span","v":6.3803286456713106},null,null,{"$f":"VLOOKUP((Q11/AJ11),VSGMSG8!$B$5:$I$11,7)","v":4},{"$f":"VLOOKUP((Q11/AJ11),VSGMSG8!$B$12:$I$17,7)","v":3},{"$f":"VLOOKUP((Q11/AJ11),VSGMSG8!$B$18:$I$23,7)","v":2},{"$f":"VLOOKUP((Q11/AJ11),VSGMSG8!$B$24:$I$29,7)","v":2},{"$f":"VLOOKUP((Q11/AJ11),LVL!A$5:F$14,5)","v":4},{"$f":"VLOOKUP((Q11/AJ11),LVL!A$15:F$26,5)","v":3},{"$f":"VLOOKUP((Q11/AJ11),LVL!A$27:F$33,5)","v":0},{"$f":"VLOOKUP((Q11/AJ11),Glulam!$A$5:$D$20,4)","v":1},{"$f":"VLOOKUP((Q11/AJ11),Glulam!$A$12:$D$20,4)","v":1},{"$f":"VLOOKUP(Q11,Steel!$E$64:$G$84,3)","v":1},{"$f":"VLOOKUP(Q11,Steel!$E$26:$G$35,3)","v":1},{"$f":"VLOOKUP(Q11,Flitch!$A$5:$F$10,6)","v":0},{"$f":"VLOOKUP(Q11,Flitch!$A$44:$F$54,6)","v":0},null,null,1,{"$f":"$R11*1000/'Basic data'!I$21","v":354.462702537295},{"$f":"$R11*1000/'Basic data'!J$21","v":716.89085906419211},null,"Face load calculation"]
[8,".9G+W",{"$f":"VLOOKUP((2+'Basic data'!M$5),'Basic data'!$G$7:$Y$14,7)","v":0.4},null,null,null,{"$f":"VLOOKUP('Basic data'!I$5,'Basic data'!$G$7:$Y$14,3)*'Basic data'!D$20*'Basic data'!F$20*'Basic data'!G$20","v":1.8559999999999999},{"$f":"VLOOKUP('Basic data'!I$5,'Basic data'!$G$7:$Y$14,3)*'Basic data'!E$20*'Basic data'!F$20*'Basic data'!G$20","v":1.1135999999999999},null,null,null,null,null,null,{"$f":"LD*(0.9*C12/VLOOKUP('Basic data'!V$5,'Basic data'!$G$7:$Y$15,16)-H12)+Overhang*(0.9*C12/VLOOKUP('Basic data'!V$5,'Basic data'!$G$7:$Y$16,16)-G12)*((LD+Overhang/2)/LD)","v":-2.5052785468908754},{"$f":"IF('Input beam data'!X$23=0,0.9*'Input beam data'!X$17+'Input beam data'!X$19,'Input beam data'!X$23)","v":0},{"$f":"MAX(ABS(O12*Span^2/8+P12*MIN('Input beam data'!X$16,(Span-'Input beam data'!X$16))/2),ABS(P12*'Input beam data'!X$16*(Span-'Input beam data'!X$16)/Span+O12*Span*MIN('Input beam data'!X$16,(Span-'Input beam data'!X$16))/2*(1-MIN('Input beam data'!X$16,(Span-'Input beam data'!X$16))/Span)))","v":2.8184383652522347},{"$f":"O12*'Input beam data'!$E$15/2+P12*MAX('Input beam data'!X$16,(Span-'Input beam data'!X$16))/Span","v":-3.7579178203363131},null,null,{"$f":"VLOOKUP((Q12/AJ12),VSGMSG8!$C$5:$H$11,6)","v":3},{"$f":"VLOOKUP((Q12/AJ12),VSGMSG8!$C$12:$H$17,6)","v":2},{"$f":"VLOOKUP((Q12/AJ12),VSGMSG8!$C$18:$H$23,6)","v":1},{"$f":"VLOOKUP((Q12/AJ12),VSGMSG8!$C$24:$H$29,6)","v":1},{"$f":"VLOOKUP((Q12/AJ12),LVL!B$5:F$14,4)","v":2},{"$f":"VLOOKUP((Q12/AJ12),LVL!B$15:F$26,4)","v":3},{"$f":"VLOOKUP((Q12/AJ12),LVL!B$27:F$33,4)","v":0},{"$f":"VLOOKUP((Q12/AJ12),Glulam!$A$5:$D$20,4)","v":0},{"$f":"VLOOKUP((Q12/AJ12),Glulam!$A$12:$D$20,4)","v":0},{"$f":"VLOOKUP(Q12,Steel!$D$39:$G$59,4)","v":1},{"$f":"VLOOKUP(Q12,Steel!$D$26:$G$35,4)","v":1},{"$f":"VLOOKUP(Q12,Flitch!$C$5:$F$10,4)","v":0},{"$f":"VLOOKUP(Q12,Flitch!$C$44:$F$54,4)","v":0},null,null,1,{"$f":"-$R12*1000/'Basic data'!I$21","v":208.77321224090628},{"$f":"-$R12*1000/'Basic data'!J$21","v":422.23795734115873}]
[9,"1.2G+yQ+S",{"$f":"VLOOKUP('Basic data'!M$5,'Basic data'!$G$7:$Y$14,7)","v":0.85},null,0,{"$f":"'Input beam data'!$O$9*VLOOKUP('Basic data'!$V$5,'Basic data'!$G$7:$Y$14,17)","v":0},null,null,null,null,null,null,null,null,{"$f":"('Input beam data'!$K$15+'Input beam data'!$O$17)*(1.2*C13/VLOOKUP('Basic data'!V$5,'Basic data'!$G$7:$Y$14,16)+F13)","v":2.7455524304475403},{"$f":"IF('Input beam data'!X$23=0,1.2*'Input beam data'!X$17+0+1.2*'Input beam data'!X$21,'Input beam data'!X$23)","v":0},{"$f":"MAX(O13*Span^2/8+P13*MIN('Input beam data'!X$16,(Span-'Input beam data'!X$16))/2,P13*'Input beam data'!X$16*(Span-'Input beam data'!X$16)/Span+O13*Span*MIN('Input beam data'!X$16,(Span-'Input beam data'!X$16))/2*(1-MIN('Input beam data'!X$16,(Span-'Input beam data'!X$16))/Span))","v":3.0887464842534826},{"$f":"O13*'Input beam data'!$E$15/2+P13*MAX('Input beam data'!X$16,(Span-'Input beam data'!X$16))/Span","v":4.1183286456713102},null,null,{"$f":"VLOOKUP((Q13/AJ13),VSGMSG8!$B$5:$I$11,7)","v":4},{"$f":"VLOOKUP((Q13/AJ13),VSGMSG8!$B$12:$I$17,7)","v":2},{"$f":"VLOOKUP((Q13/AJ13),VSGMSG8!$B$18:$I$23,7)","v":2},{"$f":"VLOOKUP((Q13/AJ13),VSGMSG8!$B$24:$I$29,7)","v":2},{"$f":"VLOOKUP((Q13/AJ13),LVL!A$5:F$14,5)","v":3},{"$f":"VLOOKUP((Q13/AJ13),LVL!A$15:F$26,5)","v":3},{"$f":"VLOOKUP((Q13/AJ13),LVL!A$27:F$33,5)","v":0},{"$f":"VLOOKUP((Q13/AJ13),Glulam!$A$5:$D$20,4)","v":1},{"$f":"VLOOKUP((Q13/AJ13),Glulam!$A$12:$D$20,4)","v":1},{"$f":"VLOOKUP(Q13,Steel!$E$64:$G$84,3)","v":1},{"$f":"VLOOKUP(Q13,Steel!$E$26:$G$35,3)","v":1},{"$f":"VLOOKUP(Q13,Flitch!$A$5:$F$10,6)","v":0},{"$f":"VLOOKUP(Q13,Flitch!$A$44:$F$54,6)","v":0},null,null,0.8,{"$f":"$R13*1000/'Basic data'!I$21","v":228.79603587062834},{"$f":"$R13*1000/'Basic data'!J$21","v":462.73355569340566},null,null,"MSG8",null,null,null,"LVL",null,null,"GL",null,"UB","MSC","Flitch"]
[null,null,null,null,null,null,null,null,null,null,null,null,null,null,null,null,"Min:",{"$f":"MIN(R5:R13)","v":-3.7579178203363131},null,"Max:",{"$f":"MAX(U5:U13)","v":5},{"$f":"MAX(V5:V13)","v":4},3,3,5,4,1,2,2,1,1,{"$f":"MAX(AF5:AF13)","v":0},{"$f":"MAX(AG5:AG13)","v":0},null,null,null,{"$f":"MAX(AK5:AK13)","v":354.462702537295},{"$f":"MAX(AL5:AL13)","v":716.89085906419211},null,"Max:",{"$f":"MAX(U5:U13)","v":5},{"$f":"MAX(V5:V13)","v":4},3,3,5,4,1,2,2,1,1,0,0]
["Application 2.  Roof and wall",null,null,null,null,null,null,"(dry props)",null,null,null,null,null,null,null,null,null,null,null,null,null,null,null,null,null,null,null,null,null,null,null,null,null,null,null,null,null,null,null,"1st size iteration:",{"$f":"MIN(AO14+1,6)","v":6},{"$f":"MIN(AP14+1,5)","v":5},4,4,{"$f":"MIN(AS14+1,9)","v":6},{"$f":"MIN(AT14+1,11)","v":5},{"$f":"MIN(AU14+1,6)","v":2},3,{"$f":"MIN(AW14+1,8)","v":3},{"$f":"MIN(AX14+1,21)","v":2},{"$f":"MIN(AY14+1,10)","v":2},{"$f":"MIN(AZ14+1,5)","v":1},{"$f":"MIN(BA14+1,10)","v":1}]
[null,null,"Basic loads",null,null,null,null,null,null,null,null,null,null,null,null,null,null,null,null,null,null,null,null,null,null,null,null,null,null,null,null,null,null,null,null,null,null,null,null,"2nd iteration:",{"$f":"MIN(AO15+1,6)","v":6},5,5,5,{"$f":"MIN(AS15+1,9)","v":7},{"$f":"MIN(AT15+1,11)","v":6},3,4,{"$f":"MIN(AW15+1,8)","v":4},{"$f":"MIN(AX15+1,21)","v":3},{"$f":"MIN(AY15+1,10)","v":3},{"$f":"MIN(AZ15+1,5)","v":2},{"$f":"MIN(BA15+1,10)","v":2}]
[null,null,"Roof",null,null,null,null,null,"Upper wall","Lower wall","Floor/deck",null,null,null,"Actions",null,null,null,null,null,"Size index's",null,null,null,null,null,null,null,null,null,null,null,null,"Deflection limits",null,"Strength",null,null,null,"3rd iteration:",{"$f":"MIN(AO16+1,6)","v":6},5,5,5,{"$f":"MIN(AS16+1,9)","v":8},{"$f":"MIN(AT16+1,11)","v":7},4,5,{"$f":"MIN(AW16+1,8)","v":5},{"$f":"MIN(AX16+1,21)","v":4},{"$f":"MIN(AY16+1,10)","v":4},{"$f":"MIN(AZ16+1,5)","v":3},{"$f":"MIN(BA16+1,10)","v":3}]
["Load case",null,"G","Ql","Qs","S","W(e)","W(r)","G","G","G","Ql","Qs","S","UDL","P","M*","V*","EI(s)","EI(a)","MSG8",null,null,null,"LVL",null,null,"GL",null,"UB","MSC","Flitch",null,"(span/)","(mm)","dur. fact.",null,null,null,"4th iteration:",6,5,5,5,9,11,6,6,8,21,10,5,10]
[1,"G+Ql",{"$f":"VLOOKUP('Basic data'!M$5,'Basic data'!$G$7:$Y$14,7)","v":0.85},0,null,null,null,null,{"$f":"VLOOKUP('Basic data'!O$5,'Basic data'!$G$7:$Y$14,9)","v":0.2},null,null,null,null,null,{"$f":"('Input beam data'!$K$15+'Input beam data'!$O$17)*(C19/VLOOKUP('Basic data'!V$5,'Basic data'!$G$7:$Y$14,16)+D19)+I19*VLOOKUP('Basic data'!Y$5,'Basic data'!G$7:Y$14,19)","v":2.8279603587062834},{"$f":"IF('Input beam data'!X$23=0,'Input beam data'!X$17,'Input beam data'!X$23)","v":0},null,null,{"$f":"(0.013*O19*Span^3+0.0298*P19*Span^2*(3*MIN('Input beam data'!X$16,Span-'Input beam data'!X$16)/Span-4*(MIN('Input beam data'!X$16,Span-'Input beam data'!X$16)/Span)^3))*AH19","v":297.78422577177162},{"$f":"(0.013*O19*Span^4+0.0208*P19*Span^3*(3*MIN('Input beam data'!X$16,Span-'Input beam data'!X$16)/Span-4*(MIN('Input beam data'!X$16,Span-'Input beam data'!X$16)/Span)^3))/(AI19/1000)","v":248.15352147647636},{"$f":"VLOOKUP(MAX(S19:T19),VSGMSG8!G$5:I$11,2)","v":6},1,{"$f":"VLOOKUP(MAX(S19:T19),VSGMSG8!G$18:I$23,2)","v":3},{"$f":"VLOOKUP(MAX(S19:T19),VSGMSG8!G$24:I$29,2)","v":4},{"$f":"VLOOKUP(MAX(S19:T19),LVL!D$5:F$14,2)","v":5},{"$f":"VLOOKUP(MAX(S19:T19),LVL!D$15:F$26,2)","v":4},{"$f":"VLOOKUP(MAX(S19:T19),LVL!D$27:F$33,2)","v":1},{"$f":"VLOOKUP(MAX(S19:T19),Glulam!C$5:E$11,2)","v":2},{"$f":"VLOOKUP(MAX(S19:T19),Glulam!C$12:E$20,2)","v":2},{"$f":"VLOOKUP(MAX(S19:T19),Steel!$F$4:$H$24,2)","v":1},{"$f":"VLOOKUP(MAX(S19:T19),Steel!$F$26:$H$35,2)","v":1},{"$f":"VLOOKUP(MAX(S19:T19),Flitch!$E$5:$F$10,2)","v":1},{"$f":"VLOOKUP(MAX(S19:T19),Flitch!E$44:F$54,2)","v":0},300,12]
[2,"G+Qs",{"$f":"VLOOKUP('Basic data'!M$5,'Basic data'!$G$7:$Y$14,7)","v":0.85},null,{"$f":"0.7*'Basic data'!$M$11","v":0.17499999999999999},null,null,null,{"$f":"VLOOKUP('Basic data'!O$5,'Basic data'!$G$7:$Y$14,9)","v":0.2},null,null,null,null,null,{"$f":"('Input beam data'!$K$15+'Input beam data'!$O$17)*(C20/VLOOKUP('Basic data'!V$5,'Basic data'!$G$7:$Y$14,16)+E20)+I20*VLOOKUP('Basic data'!Y$5,'Basic data'!G$7:Y$14,19)","v":3.2829603587062834},{"$f":"IF('Input beam data'!X$23=0,'Input beam data'!X$17+0.7*'Input beam data'!X$18,'Input beam data'!X$23)","v":0},null,null,{"$f":"(0.013*O20*Span^3+0.0298*P20*Span^2*(3*MIN('Input beam data'!X$16,Span-'Input beam data'!X$16)/Span-4*(MIN('Input beam data'!X$16,Span-'Input beam data'!X$16)/Span)^3))*AH20","v":345.69572577177166},{"$f":"(0.013*O20*Span^4+0.0208*P20*Span^3*(3*MIN('Input beam data'!X$16,Span-'Input beam data'!X$16)/Span-4*(MIN('Input beam data'!X$16,Span-'Input beam data'!X$16)/Span)^3))/(AI20/1000)","v":288.07977147647637},{"$f":"VLOOKUP(MAX(S20:T20),VSGMSG8!E$5:I$11,4)","v":5},3,{"$f":"VLOOKUP(MAX(S20:T20),VSGMSG8!E$18:I$23,4)","v":3},{"$f":"VLOOKUP(MAX(S20:T20),VSGMSG8!E$24:I$29,4)","v":3},{"$f":"VLOOKUP(MAX(S20:T20),LVL!C$5:F$14,3)","v":5},{"$f":"VLOOKUP(MAX(S20:T20),LVL!C$15:F$26,3)","v":4},{"$f":"VLOOKUP(MAX(S20:T20),LVL!C$27:F$33,3)","v":1},{"$f":"VLOOKUP(MAX(S20:T20),Glulam!B$5:E$11,3)","v":2},{"$f":"VLOOKUP(MAX(S20:T20),Glulam!B$12:E$20,3)","v":1},{"$f":"VLOOKUP(MAX(S20:T20),Steel!$F$4:$H$24,2)","v":1},{"$f":"VLOOKUP(MAX(S20:T20),Steel!$F$26:$H$35,2)","v":1},{"$f":"VLOOKUP(MAX(S20:T20),Flitch!$D$5:$F$10,3)","v":1},{"$f":"VLOOKUP(MAX(S20:T20),Flitch!$D$44:$F$54,3)","v":0},300,12]
[3,"Spare"]
[4,"G+S",{"$f":"VLOOKUP('Basic data'!M$5,'Basic data'!$G$7:$Y$14,7)","v":0.85},null,0,{"$f":"0.68*'Input beam data'!$O$9*VLOOKUP('Basic data'!$V$5,'Basic data'!$G$7:$Y$14,17)","v":0},null,null,{"$f":"VLOOKUP('Basic data'!O$5,'Basic data'!$G$7:$Y$14,9)","v":0.2},null,null,null,null,null,{"$f":"('Input beam data'!$K$15+'Input beam data'!$O$17)*(C22/VLOOKUP('Basic data'!V$5,'Basic data'!$G$7:$Y$14,16)+F22)+I22*VLOOKUP('Basic data'!Y$5,'Basic data'!G$7:Y$14,19)","v":2.8279603587062834},{"$f":"IF('Input beam data'!X$23=0,'Input beam data'!X$17+'Input beam data'!X$21,'Input beam data'!X$23)","v":0},null,null,{"$f":"(0.013*O22*Span^3+0.0298*P22*Span^2*(3*MIN('Input beam data'!X$16,Span-'Input beam data'!X$16)/Span-4*(MIN('Input beam data'!X$16,Span-'Input beam data'!X$16)/Span)^3))*AH22","v":297.78422577177162},{"$f":"(0.013*O22*Span^4+0.0208*P22*Span^3*(3*MIN('Input beam data'!X$16,Span-'Input beam data'!X$16)/Span-4*(MIN('Input beam data'!X$16,Span-'Input beam data'!X$16)/Span)^3))/(AI22/1000)","v":248.15352147647636},{"$f":"VLOOKUP(MAX(S22:T22),VSGMSG8!E$5:I$11,4)","v":5},0,{"$f":"VLOOKUP(MAX(S22:T22),VSGMSG8!E$18:I$23,4)","v":2},{"$f":"VLOOKUP(MAX(S22:T22),VSGMSG8!E$24:I$29,4)","v":3},{"$f":"VLOOKUP(MAX(S22:T22),LVL!C$5:F$14,3)","v":4},{"$f":"VLOOKUP(MAX(S22:T22),LVL!C$15:F$26,3)","v":4},{"$f":"VLOOKUP(MAX(S22:T22),LVL!C$27:F$33,3)","v":1},{"$f":"VLOOKUP(MAX(S22:T22),Glulam!B$5:E$11,3)","v":2},{"$f":"VLOOKUP(MAX(S22:T22),Glulam!B$12:E$20,3)","v":1},{"$f":"VLOOKUP(MAX(S22:T22),Steel!$F$4:$H$24,2)","v":1},{"$f":"VLOOKUP(MAX(S22:T22),Steel!$F$26:$H$35,2)","v":1},{"$f":"VLOOKUP(MAX(S22:T22),Flitch!$D$5:$F$10,3)","v":0},{"$f":"VLOOKUP(MAX(S22:T22),Flitch!$D$44:$F$54,3)","v":0},300,12]
[5,"1.35G",{"$f":"VLOOKUP('Basic data'!M$5,'Basic data'!$G$7:$Y$14,7)","v":0.85},null,null,null,null,null,{"$f":"VLOOKUP('Basic data'!O$5,'Basic data'!$G$7:$Y$14,9)","v":0.2},null,null,null,null,null,{"$f":"('Input beam data'!$K$15+'Input beam data'!$O$17)*(1.35*C23/VLOOKUP('Basic data'!V$5,'Basic data'!$G$7:$Y$14,16))+1.35*I23*VLOOKUP('Basic data'!Y$5,'Basic data'!G$7:Y$14,19)","v":3.8177464842534827},{"$f":"IF('Input beam data'!X$23=0,1.35*'Input beam data'!X$17,'Input beam data'!X$23)","v":0},{"$f":"MAX(O23*Span^2/8+P23*MIN('Input beam data'!X$16,(Span-'Input beam data'!X$16))/2,P23*'Input beam data'!X$16*(Span-'Input beam data'!X$16)/Span+O23*Span*MIN('Input beam data'!X$16,(Span-'Input beam data'!X$16))/2*(1-MIN('Input beam data'!X$16,(Span-'Input beam data'!X$16))/Span))","v":4.2949647947851677},{"$f":"O23*'Input beam data'!$E$15/2+P23*MAX('Input beam data'!X$16,(Span-'Input beam data'!X$16))/Span","v":5.7266197263802239},null,null,{"$f":"VLOOKUP((Q23/AJ23),VSGMSG8!$B$5:$I$11,7)","v":6},{"$f":"VLOOKUP((Q23/AJ23),VSGMSG8!$B$12:$I$17,7)","v":3},{"$f":"VLOOKUP((Q23/AJ23),VSGMSG8!$B$18:$I$23,7)","v":3},{"$f":"VLOOKUP((Q23/AJ23),VSGMSG8!$B$24:$I$29,7)","v":3},{"$f":"VLOOKUP((Q23/AJ23),LVL!A$5:F$14,5)","v":4},{"$f":"VLOOKUP((Q23/AJ23),LVL!A$15:F$26,5)","v":3},{"$f":"VLOOKUP((Q23/AJ23),LVL!A$27:F$33,5)","v":0},{"$f":"VLOOKUP((Q23/AJ23),Glulam!$A$5:$D$20,4)","v":2},{"$f":"VLOOKUP((Q23/AJ23),Glulam!$A$12:$D$20,4)","v":2},{"$f":"VLOOKUP(Q23,Steel!$E$64:$G$84,3)","v":1},{"$f":"VLOOKUP(Q23,Steel!$E$26:$G$35,3)","v":1},{"$f":"VLOOKUP(Q23,Flitch!$B$5:$F$10,5)","v":0},{"$f":"VLOOKUP(Q23,Flitch!$B$44:$F$54,5)","v":0},null,null,0.6,{"$f":"$R23*1000/'Basic data'!I$21","v":318.1455403544569},{"$f":"$R23*1000/'Basic data'!J$21","v":643.44041869440719}]
[6,"1.2G+1.5Q",{"$f":"VLOOKUP('Basic data'!M$5,'Basic data'!$G$7:$Y$14,7)","v":0.85},null,{"$f":"'Basic data'!M$11","v":0.25},null,null,null,{"$f":"VLOOKUP('Basic data'!O$5,'Basic data'!$G$7:$Y$14,9)","v":0.2},null,null,null,null,null,{"$f":"('Input beam data'!$K$15+'Input beam data'!$O$17)*(1.2*C24/VLOOKUP('Basic data'!V$5,'Basic data'!$G$7:$Y$14,16)+1.5*E24)+1.2*I24*VLOOKUP('Basic data'!Y$5,'Basic data'!G$7:Y$14,19)","v":4.36855243044754},{"$f":"IF('Input beam data'!X$23=0,1.2*'Input beam data'!X$17+1.5*'Input beam data'!X$18,'Input beam data'!X$23)","v":0},{"$f":"MAX(O24*Span^2/8+P24*MIN('Input beam data'!X$16,(Span-'Input beam data'!X$16))/2,P24*'Input beam data'!X$16*(Span-'Input beam data'!X$16)/Span+O24*Span*MIN('Input beam data'!X$16,(Span-'Input beam data'!X$16))/2*(1-MIN('Input beam data'!X$16,(Span-'Input beam data'!X$16))/Span))","v":4.9146214842534821},{"$f":"O24*'Input beam data'!$E$15/2+P24*MAX('Input beam data'!X$16,(Span-'Input beam data'!X$16))/Span","v":6.5528286456713101},null,null,{"$f":"VLOOKUP((Q24/AJ24),VSGMSG8!$B$5:$I$11,7)","v":5},4,{"$f":"VLOOKUP((Q24/AJ24),VSGMSG8!$B$18:$I$23,7)","v":2},{"$f":"VLOOKUP((Q24/AJ24),VSGMSG8!$B$24:$I$29,7)","v":3},{"$f":"VLOOKUP((Q24/AJ24),LVL!A$5:F$14,5)","v":4},{"$f":"VLOOKUP((Q24/AJ24),LVL!A$15:F$26,5)","v":3},{"$f":"VLOOKUP((Q24/AJ24),LVL!A$27:F$33,5)","v":0},{"$f":"VLOOKUP((Q24/AJ24),Glulam!$A$5:$D$20,4)","v":2},{"$f":"VLOOKUP((Q24/AJ24),Glulam!$A$12:$D$20,4)","v":2},{"$f":"VLOOKUP(Q24,Steel!$E$64:$G$84,3)","v":1},{"$f":"VLOOKUP(Q24,Steel!$E$26:$G$35,3)","v":1},{"$f":"VLOOKUP(Q24,Flitch!$A$5:$F$10,6)","v":0},{"$f":"VLOOKUP(Q24,Flitch!$A$44:$F$54,6)","v":0},null,null,0.8,{"$f":"$R24*1000/'Basic data'!I$21","v":364.04603587062837},{"$f":"$R24*1000/'Basic data'!J$21","v":736.2728815361022}]
[7,"1.2G+yQ+W",{"$f":"VLOOKUP('Basic data'!M$5,'Basic data'!$G$7:$Y$14,7)","v":0.85},null,0,null,{"$f":"VLOOKUP('Basic data'!I$5,'Basic data'!$G$7:$Y$14,3)*'Basic data'!D$19*'Basic data'!F$19*'Basic data'!G$19","v":0.23199999999999998},{"$f":"VLOOKUP('Basic data'!I$5,'Basic data'!$G$7:$Y$14,3)*'Basic data'!E$19*'Basic data'!F$19*'Basic data'!G$19","v":0.57999999999999996},{"$f":"VLOOKUP('Basic data'!O$5,'Basic data'!$G$7:$Y$14,9)","v":0.2},null,null,null,null,null,{"$f":"('Input beam data'!$K$15+'Input beam data'!$O$17)*(1.2*C25/VLOOKUP('Basic data'!V$5,'Basic data'!$G$7:$Y$14,16)+H25)+1.2*I25*VLOOKUP('Basic data'!Y$5,'Basic data'!G$7:Y$14,19)","v":4.9015524304475404},{"$f":"IF('Input beam data'!X$23=0,1.2*'Input beam data'!X$17+0+'Input beam data'!X$20,'Input beam data'!X$23)","v":0},{"$f":"MAX(O25*Span^2/8+P25*MIN('Input beam data'!X$16,(Span-'Input beam data'!X$16))/2,P25*'Input beam data'!X$16*(Span-'Input beam data'!X$16)/Span+O25*Span*MIN('Input beam data'!X$16,(Span-'Input beam data'!X$16))/2*(1-MIN('Input beam data'!X$16,(Span-'Input beam data'!X$16))/Span))","v":5.5142464842534826},{"$f":"O25*'Input beam data'!$E$15/2+P25*MAX('Input beam data'!X$16,(Span-'Input beam data'!X$16))/Span","v":7.3523286456713102},null,null,{"$f":"VLOOKUP((Q25/AJ25),VSGMSG8!$B$5:$I$11,7)","v":5},{"$f":"VLOOKUP((Q25/AJ25),VSGMSG8!$B$12:$I$17,7)","v":3},{"$f":"VLOOKUP((Q25/AJ25),VSGMSG8!$B$18:$I$23,7)","v":2},{"$f":"VLOOKUP((Q25/AJ25),VSGMSG8!$B$24:$I$29,7)","v":2},{"$f":"VLOOKUP((Q25/AJ25),LVL!A$5:F$14,5)","v":4},{"$f":"VLOOKUP((Q25/AJ25),LVL!A$15:F$26,5)","v":3},{"$f":"VLOOKUP((Q25/AJ25),LVL!A$27:F$33,5)","v":0},{"$f":"VLOOKUP((Q25/AJ25),Glulam!$A$5:$D$20,4)","v":1},{"$f":"VLOOKUP((Q25/AJ25),Glulam!$A$12:$D$20,4)","v":1},{"$f":"VLOOKUP(Q25,Steel!$E$64:$G$84,3)","v":1},{"$f":"VLOOKUP(Q25,Steel!$E$26:$G$35,3)","v":1},{"$f":"VLOOKUP(Q25,Flitch!$A$5:$F$10,6)","v":0},{"$f":"VLOOKUP(Q25,Flitch!$A$44:$F$54,6)","v":0},null,null,1,{"$f":"$R25*1000/'Basic data'!I$21","v":408.462702537295},{"$f":"$R25*1000/'Basic data'!J$21","v":826.10434221025957}]
[8,".9G+W",{"$f":"VLOOKUP((2+'Basic data'!M$5),'Basic data'!$G$7:$Y$14,7)","v":0.4},null,null,null,{"$f":"VLOOKUP('Basic data'!I$5,'Basic data'!$G$7:$Y$14,3)*'Basic data'!D$20*'Basic data'!F$20*'Basic data'!G$20","v":1.8559999999999999},{"$f":"VLOOKUP('Basic data'!I$5,'Basic data'!$G$7:$Y$14,3)*'Basic data'!E$20*'Basic data'!F$20*'Basic data'!G$20","v":1.1135999999999999},{"$f":"VLOOKUP((2+'Basic data'!O$5),'Basic data'!$G$7:$Y$14,9)","v":0.1},null,null,null,null,null,{"$f":"LD*(0.9*C26/VLOOKUP('Basic data'!V$5,'Basic data'!$G$7:$Y$14,16)-H26)+Overhang*(0.9*C26/VLOOKUP('Basic data'!V$5,'Basic data'!$G$7:$Y$14,16)-G26)*((LD+Overhang/2)/LD)+0.9*I26*VLOOKUP('Basic data'!Y$5,'Basic data'!G$7:Y$14,19)","v":-2.2622785468908755},{"$f":"IF('Input beam data'!X$23=0,0.9*'Input beam data'!X$17+'Input beam data'!X$19,'Input beam data'!X$23)","v":0},{"$f":"MAX(ABS(O26*Span^2/8+P26*MIN('Input beam data'!X$16,(Span-'Input beam data'!X$16))/2),ABS(P26*'Input beam data'!X$16*(Span-'Input beam data'!X$16)/Span+O26*Span*MIN('Input beam data'!X$16,(Span-'Input beam data'!X$16))/2*(1-MIN('Input beam data'!X$16,(Span-'Input beam data'!X$16))/Span)))","v":2.545063365252235},{"$f":"O26*'Input beam data'!$E$15/2+P26*MAX('Input beam data'!X$16,(Span-'Input beam data'!X$16))/Span","v":-3.393417820336313},null,null,{"$f":"VLOOKUP((Q26/AJ26),VSGMSG8!$C$5:$H$11,6)","v":3},{"$f":"VLOOKUP((Q26/AJ26),VSGMSG8!$C$12:$H$17,6)","v":1},{"$f":"VLOOKUP((Q26/AJ26),VSGMSG8!$C$18:$H$23,6)","v":1},{"$f":"VLOOKUP((Q26/AJ26),VSGMSG8!$C$24:$H$29,6)","v":1},{"$f":"VLOOKUP((Q26/AJ26),LVL!B$5:F$14,4)","v":2},{"$f":"VLOOKUP((Q26/AJ26),LVL!B$15:F$26,4)","v":3},{"$f":"VLOOKUP((Q26/AJ26),LVL!B$27:F$33,4)","v":0},{"$f":"VLOOKUP((Q26/AJ26),Glulam!$A$5:$D$20,4)","v":0},{"$f":"VLOOKUP((Q26/AJ26),Glulam!$A$12:$D$20,4)","v":0},{"$f":"VLOOKUP(Q26,Steel!$D$39:$G$59,4)","v":1},{"$f":"VLOOKUP(Q26,Steel!$D$26:$G$35,4)","v":1},{"$f":"VLOOKUP(Q26,Flitch!$C$5:$F$10,4)","v":0},{"$f":"VLOOKUP(Q26,Flitch!$C$44:$F$54,4)","v":0},null,null,1,{"$f":"-$R26*1000/'Basic data'!I$21","v":188.52321224090628},{"$f":"-$R26*1000/'Basic data'!J$21","v":381.28290116138345}]
[9,"1.2G+yQ+S",{"$f":"VLOOKUP('Basic data'!M$5,'Basic data'!$G$7:$Y$14,7)","v":0.85},null,0,{"$f":"'Input beam data'!$O$9*VLOOKUP('Basic data'!$V$5,'Basic data'!$G$7:$Y$14,17)","v":0},null,null,{"$f":"VLOOKUP('Basic data'!O$5,'Basic data'!$G$7:$Y$14,9)","v":0.2},null,null,null,null,null,{"$f":"('Input beam data'!$K$15+'Input beam data'!$O$17)*(1.2*C27/VLOOKUP('Basic data'!V$5,'Basic data'!$G$7:$Y$14,16)+F27)+1.2*I27*VLOOKUP('Basic data'!Y$5,'Basic data'!G$7:Y$14,19)","v":3.3935524304475404},{"$f":"IF('Input beam data'!X$23=0,1.2*'Input beam data'!X$17+0+1.2*'Input beam data'!X$21,'Input beam data'!X$23)","v":0},{"$f":"MAX(O27*Span^2/8+P27*MIN('Input beam data'!X$16,(Span-'Input beam data'!X$16))/2,P27*'Input beam data'!X$16*(Span-'Input beam data'!X$16)/Span+O27*Span*MIN('Input beam data'!X$16,(Span-'Input beam data'!X$16))/2*(1-MIN('Input beam data'!X$16,(Span-'Input beam data'!X$16))/Span))","v":3.8177464842534832},{"$f":"O27*'Input beam data'!$E$15/2+P27*MAX('Input beam data'!X$16,(Span-'Input beam data'!X$16))/Span","v":5.0903286456713106},null,null,{"$f":"VLOOKUP((Q27/AJ27),VSGMSG8!$B$5:$I$11,7)","v":4},{"$f":"VLOOKUP((Q27/AJ27),VSGMSG8!$B$12:$I$17,7)","v":3},{"$f":"VLOOKUP((Q27/AJ27),VSGMSG8!$B$18:$I$23,7)","v":2},{"$f":"VLOOKUP((Q27/AJ27),VSGMSG8!$B$24:$I$29,7)","v":2},{"$f":"VLOOKUP((Q27/AJ27),LVL!A$5:F$14,5)","v":4},{"$f":"VLOOKUP((Q27/AJ27),LVL!A$15:F$26,5)","v":3},{"$f":"VLOOKUP((Q27/AJ27),LVL!A$27:F$33,5)","v":0},{"$f":"VLOOKUP((Q27/AJ27),Glulam!$A$5:$D$20,4)","v":1},{"$f":"VLOOKUP((Q27/AJ27),Glulam!$A$12:$D$20,4)","v":1},{"$f":"VLOOKUP(Q27,Steel!$E$64:$G$84,3)","v":1},{"$f":"VLOOKUP(Q27,Steel!$E$26:$G$35,3)","v":1},{"$f":"VLOOKUP(Q27,Flitch!$A$5:$F$10,6)","v":0},{"$f":"VLOOKUP(Q27,Flitch!$A$44:$F$54,6)","v":0},null,null,0.8,{"$f":"$R27*1000/'Basic data'!I$21","v":282.79603587062837},{"$f":"$R27*1000/'Basic data'!J$21","v":571.94703883947307}]
[null,null,null,null,null,null,null,null,null,null,null,null,null,null,null,null,"Min:",{"$f":"MIN(R19:R27)","v":-3.393417820336313},null,"Max:",{"$f":"MAX(U19:U27)","v":6},4,3,4,5,4,1,2,2,1,1,{"$f":"MAX(AF19:AF27)","v":1},{"$f":"MAX(AG19:AG27)","v":0},null,null,null,{"$f":"MAX(AK19:AK27)","v":408.462702537295},{"$f":"MAX(AL19:AL27)","v":826.10434221025957}]
["Application 3.  Roof wall and floor",null,null,null,null,null,null,null,"(dry props)"]
[null,null,"Basic loads",null,null,null,null,null,null,null,null,"Note:  #DIV/0 only because some parameters are not relevant to the application currently selected"]
[null,null,"Roof",null,null,null,null,null,"Upper wall","Lower wall","Floor/deck",null,null,null,"Actions",null,null,null,null,null,"Size index's",null,null,null,null,null,null,null,null,null,null,null,null,"Deflection limits",null,"Strength"]
["Load case",null,"G","Ql","Qs","S","W(e)","W(r)","G","G","G","Ql","Qs","S","UDL","P","M*","V*","EI(s)","EI(a)","MSG8",null,null,null,"LVL",null,null,"GL",null,"UB","MSC","Flitch",null,"(span/)","(mm)","dur. fact."]
[1,"G+Ql",{"$f":"VLOOKUP('Basic data'!M$5,'Basic data'!$G$7:$Y$14,7)","v":0.85},0,null,null,null,null,{"$f":"VLOOKUP('Basic data'!O$5,'Basic data'!$G$7:$Y$14,9)","v":0.2},null,{"$f":"'Basic data'!S$7","v":0.4},{"$f":"0.4*(MAX(MIN(1,0.3+3/('Input beam data'!$E$15*'Input beam data'!$K$21)^0.5),0.5))*VLOOKUP('Basic data'!Q$5,'Basic data'!G$7:Y$14,11)","v":0.60000000000000009},null,null,{"$f":"('Input beam data'!$K$15+'Input beam data'!$O$17)*(C33/VLOOKUP('Basic data'!V$5,'Basic data'!$G$7:$Y$14,16)+D33)+I33*VLOOKUP('Basic data'!Y$5,'Basic data'!G$7:Y$14,19)+'Input beam data'!$K$21*(Calc!K33+Calc!L33)","v":5.8279603587062834},{"$f":"IF('Input beam data'!X$23=0,'Input beam data'!X$17,'Input beam data'!X$23)","v":0},null,null,{"$f":"(0.013*O33*Span^3+0.0298*P33*Span^2*(3*MIN('Input beam data'!X$16,Span-'Input beam data'!X$16)/Span-4*(MIN('Input beam data'!X$16,Span-'Input beam data'!X$16)/Span)^3))*AH33","v":613.68422577177171},{"$f":"(0.013*O33*Span^4+0.0208*P33*Span^3*(3*MIN('Input beam data'!X$16,Span-'Input beam data'!X$16)/Span-4*(MIN('Input beam data'!X$16,Span-'Input beam data'!X$16)/Span)^3))/(AI33/1000)","v":511.40352147647633},{"$f":"VLOOKUP(MAX(S33:T33),VSGMSG8!G$5:I$11,2)","v":6},{"$f":"VLOOKUP(MAX(S33:T33),VSGMSG8!G$12:I$17,2)","v":5},{"$f":"VLOOKUP(MAX(S33:T33),VSGMSG8!G$18:I$23,2)","v":5},{"$f":"VLOOKUP(MAX(S33:T33),VSGMSG8!G$24:I$29,2)","v":5},{"$f":"VLOOKUP(MAX(S33:T33),LVL!D$5:F$14,2)","v":6},{"$f":"VLOOKUP(MAX(S33:T33),LVL!D$15:F$26,2)","v":6},{"$f":"VLOOKUP(MAX(S33:T33),LVL!D$27:F$33,2)","v":2},{"$f":"VLOOKUP(MAX(S33:T33),Glulam!C$5:E$11,2)","v":4},{"$f":"VLOOKUP(MAX(S33:T33),Glulam!C$12:E$20,2)","v":3},{"$f":"VLOOKUP(MAX(S33:T33),Steel!$F$4:$H$24,2)","v":1},{"$f":"VLOOKUP(MAX(S33:T33),Steel!$F$26:$H$35,2)","v":2},{"$f":"VLOOKUP(MAX(S33:T33),Flitch!$E$5:$F$10,2)","v":1},{"$f":"VLOOKUP(MAX(S33:T33),Flitch!E$44:F$54,2)","v":1},300,12]
[2,"G+Qs",{"$f":"VLOOKUP('Basic data'!M$5,'Basic data'!$G$7:$Y$14,7)","v":0.85},null,{"$f":"0.7*'Basic data'!$M$11","v":0.17499999999999999},null,null,null,{"$f":"VLOOKUP('Basic data'!O$5,'Basic data'!$G$7:$Y$14,9)","v":0.2},null,{"$f":"'Basic data'!S$7","v":0.4},null,{"$f":"0.7*(MAX(MIN(1,0.3+3/('Input beam data'!$E$15*'Input beam data'!$K$21)^0.5),0.5))*VLOOKUP('Basic data'!Q$5,'Basic data'!G$7:Y$14,11)","v":1.0499999999999998},null,{"$f":"('Input beam data'!$K$15+'Input beam data'!$O$17)*(C34/VLOOKUP('Basic data'!V$5,'Basic data'!$G$7:$Y$14,16)+E34)+I34*VLOOKUP('Basic data'!Y$5,'Basic data'!G$7:Y$14,19)+'Input beam data'!$K$21*(Calc!K34+Calc!M34)","v":7.6329603587062831},{"$f":"IF('Input beam data'!X$23=0,'Input beam data'!X$17+0.7*'Input beam data'!X$18,'Input beam data'!X$23)","v":0},null,null,{"$f":"(0.013*O34*Span^3+0.0298*P34*Span^2*(3*MIN('Input beam data'!X$16,Span-'Input beam data'!X$16)/Span-4*(MIN('Input beam data'!X$16,Span-'Input beam data'!X$16)/Span)^3))*AH34","v":803.75072577177161},{"$f":"(0.013*O34*Span^4+0.0208*P34*Span^3*(3*MIN('Input beam data'!X$16,Span-'Input beam data'!X$16)/Span-4*(MIN('Input beam data'!X$16,Span-'Input beam data'!X$16)/Span)^3))/(AI34/1000)","v":669.79227147647646},{"$f":"VLOOKUP(MAX(S34:T34),VSGMSG8!E$5:I$11,4)","v":6},{"$f":"VLOOKUP(MAX(S34:T34),VSGMSG8!E$12:I$17,4)","v":5},{"$f":"VLOOKUP(MAX(S34:T34),VSGMSG8!E$18:I$23,4)","v":4},{"$f":"VLOOKUP(MAX(S34:T34),VSGMSG8!E$24:I$29,4)","v":4},{"$f":"VLOOKUP(MAX(S34:T34),LVL!C$5:F$14,3)","v":6},{"$f":"VLOOKUP(MAX(S34:T34),LVL!C$15:F$26,3)","v":6},{"$f":"VLOOKUP(MAX(S34:T34),LVL!C$27:F$33,3)","v":2},{"$f":"VLOOKUP(MAX(S34:T34),Glulam!B$5:E$11,3)","v":3},{"$f":"VLOOKUP(MAX(S34:T34),Glulam!B$12:E$20,3)","v":3},{"$f":"VLOOKUP(MAX(S34:T34),Steel!$F$4:$H$24,2)","v":1},{"$f":"VLOOKUP(MAX(S34:T34),Steel!$F$26:$H$35,2)","v":2},{"$f":"VLOOKUP(MAX(S34:T34),Flitch!$D$5:$F$10,3)","v":1},{"$f":"VLOOKUP(MAX(S34:T34),Flitch!$D$44:$F$54,3)","v":1},300,12]
[3,"Spare"]
[4,"G+S",{"$f":"VLOOKUP('Basic data'!M$5,'Basic data'!$G$7:$Y$14,7)","v":0.85},null,0,{"$f":"0.68*'Input beam data'!$O$9*VLOOKUP('Basic data'!$V$5,'Basic data'!$G$7:$Y$14,17)","v":0},null,null,{"$f":"VLOOKUP('Basic data'!O$5,'Basic data'!$G$7:$Y$14,9)","v":0.2},null,{"$f":"'Basic data'!S$7","v":0.4},null,{"$f":"0.7*(MAX(MIN(1,0.3+3/('Input beam data'!$E$15*'Input beam data'!$K$21)^0.5),0.5))*VLOOKUP('Basic data'!Q$5,'Basic data'!G$7:Y$14,11)","v":1.0499999999999998},null,{"$f":"('Input beam data'!$K$15+'Input beam data'!$O$17)*(C36/VLOOKUP('Basic data'!V$5,'Basic data'!$G$7:$Y$14,16)+F36)+I36*VLOOKUP('Basic data'!Y$5,'Basic data'!G$7:Y$14,19)+'Input beam data'!$K$21*(Calc!K36+Calc!M36)","v":7.177960358706283},{"$f":"IF('Input beam data'!X$23=0,'Input beam data'!X$17+'Input beam data'!X$21,'Input beam data'!X$23)","v":0},null,null,{"$f":"(0.013*O36*Span^3+0.0298*P36*Span^2*(3*MIN('Input beam data'!X$16,Span-'Input beam data'!X$16)/Span-4*(MIN('Input beam data'!X$16,Span-'Input beam data'!X$16)/Span)^3))*AH36","v":755.83922577177157},{"$f":"(0.013*O36*Span^4+0.0208*P36*Span^3*(3*MIN('Input beam data'!X$16,Span-'Input beam data'!X$16)/Span-4*(MIN('Input beam data'!X$16,Span-'Input beam data'!X$16)/Span)^3))/(AI36/1000)","v":629.86602147647636},{"$f":"VLOOKUP(MAX(S36:T36),VSGMSG8!E$5:I$11,4)","v":6},{"$f":"VLOOKUP(MAX(S36:T36),VSGMSG8!E$12:I$17,4)","v":4},{"$f":"VLOOKUP(MAX(S36:T36),VSGMSG8!E$18:I$23,4)","v":4},{"$f":"VLOOKUP(MAX(S36:T36),VSGMSG8!E$24:I$29,4)","v":4},{"$f":"VLOOKUP(MAX(S36:T36),LVL!C$5:F$14,3)","v":6},{"$f":"VLOOKUP(MAX(S36:T36),LVL!C$15:F$26,3)","v":5},{"$f":"VLOOKUP(MAX(S36:T36),LVL!C$27:F$33,3)","v":2},{"$f":"VLOOKUP(MAX(S36:T36),Glulam!B$5:E$11,3)","v":3},{"$f":"VLOOKUP(MAX(S36:T36),Glulam!B$12:E$20,3)","v":3},{"$f":"VLOOKUP(MAX(S36:T36),Steel!$F$4:$H$24,2)","v":1},{"$f":"VLOOKUP(MAX(S36:T36),Steel!$F$26:$H$35,2)","v":2},{"$f":"VLOOKUP(MAX(S36:T36),Flitch!$D$5:$F$10,3)","v":1},{"$f":"VLOOKUP(MAX(S36:T36),Flitch!$D$44:$F$54,3)","v":1},300,12]
[5,"1.35G",{"$f":"VLOOKUP('Basic data'!M$5,'Basic data'!$G$7:$Y$14,7)","v":0.85},null,null,null,null,null,{"$f":"VLOOKUP('Basic data'!O$5,'Basic data'!$G$7:$Y$14,9)","v":0.2},null,{"$f":"'Basic data'!S$7","v":0.4},null,0,null,{"$f":"('Input beam data'!$K$15+'Input beam data'!$O$17)*(1.35*C37/VLOOKUP('Basic data'!V$5,'Basic data'!$G$7:$Y$14,16))+1.35*I37*VLOOKUP('Basic data'!Y$5,'Basic data'!G$7:Y$14,19)+1.35*'Input beam data'!$K$21*Calc!K37","v":5.4377464842534833},{"$f":"IF('Input beam data'!X$23=0,1.35*'Input beam data'!X$17,'Input beam data'!X$23)","v":0},{"$f":"MAX(O37*Span^2/8+P37*MIN('Input beam data'!X$16,(Span-'Input beam data'!X$16))/2,P37*'Input beam data'!X$16*(Span-'Input beam data'!X$16)/Span+O37*Span*MIN('Input beam data'!X$16,(Span-'Input beam data'!X$16))/2*(1-MIN('Input beam data'!X$16,(Span-'Input beam data'!X$16))/Span))","v":6.1174647947851684},{"$f":"O37*'Input beam data'!$E$15/2+P37*MAX('Input beam data'!X$16,(Span-'Input beam data'!X$16))/Span","v":8.1566197263802245},null,null,{"$f":"VLOOKUP((Q37/AJ37),VSGMSG8!$B$5:$I$11,7)","v":6},{"$f":"VLOOKUP((Q37/AJ37),VSGMSG8!$B$12:$I$17,7)","v":4},{"$f":"VLOOKUP((Q37/AJ37),VSGMSG8!$B$18:$I$23,7)","v":3},{"$f":"VLOOKUP((Q37/AJ37),VSGMSG8!$B$24:$I$29,7)","v":4},{"$f":"VLOOKUP((Q37/AJ37),LVL!A$5:F$14,5)","v":5},{"$f":"VLOOKUP((Q37/AJ37),LVL!A$15:F$26,5)","v":4},{"$f":"VLOOKUP((Q37/AJ37),LVL!A$27:F$33,5)","v":1},{"$f":"VLOOKUP((Q37/AJ37),Glulam!$A$5:$D$20,4)","v":3},{"$f":"VLOOKUP((Q37/AJ37),Glulam!$A$12:$D$20,4)","v":3},{"$f":"VLOOKUP(Q37,Steel!$E$64:$G$84,3)","v":1},{"$f":"VLOOKUP(Q37,Steel!$E$26:$G$35,3)","v":2},{"$f":"VLOOKUP(Q37,Flitch!$B$5:$F$10,5)","v":1},{"$f":"VLOOKUP(Q37,Flitch!$B$44:$F$54,5)","v":1},null,null,0.6,{"$f":"$R37*1000/'Basic data'!I$21","v":453.1455403544569},{"$f":"$R37*1000/'Basic data'!J$21","v":916.47412655957567}]
[6,"1.2G+1.5Q",{"$f":"VLOOKUP('Basic data'!M$5,'Basic data'!$G$7:$Y$14,7)","v":0.85},null,{"$f":"'Basic data'!M$11","v":0.25},null,null,null,{"$f":"VLOOKUP('Basic data'!O$5,'Basic data'!$G$7:$Y$14,9)","v":0.2},null,{"$f":"'Basic data'!S$7","v":0.4},null,{"$f":"(MAX(MIN(1,0.3+3/('Input beam data'!$E$15*'Input beam data'!$K$21)^0.5),0.5))*VLOOKUP('Basic data'!Q$5,'Basic data'!G$7:Y$14,11)","v":1.5},null,{"$f":"('Input beam data'!$K$15+'Input beam data'!$O$17)*(1.2*C38/VLOOKUP('Basic data'!V$5,'Basic data'!$G$7:$Y$14,16)+1.5*E38)+1.2*I38*VLOOKUP('Basic data'!Y$5,'Basic data'!G$7:Y$14,19)+'Input beam data'!$K$21*(1.2*Calc!K38+1.5*Calc!M38)","v":12.55855243044754},{"$f":"IF('Input beam data'!X$23=0,1.2*'Input beam data'!X$17+1.5*'Input beam data'!X$18,'Input beam data'!X$23)","v":0},{"$f":"MAX(O38*Span^2/8+P38*MIN('Input beam data'!X$16,(Span-'Input beam data'!X$16))/2,P38*'Input beam data'!X$16*(Span-'Input beam data'!X$16)/Span+O38*Span*MIN('Input beam data'!X$16,(Span-'Input beam data'!X$16))/2*(1-MIN('Input beam data'!X$16,(Span-'Input beam data'!X$16))/Span))","v":14.128371484253481},{"$f":"O38*'Input beam data'!$E$15/2+P38*MAX('Input beam data'!X$16,(Span-'Input beam data'!X$16))/Span","v":18.837828645671308},null,null,{"$f":"VLOOKUP((Q38/AJ38),VSGMSG8!$B$5:$I$11,7)","v":6},{"$f":"VLOOKUP((Q38/AJ38),VSGMSG8!$B$12:$I$17,7)","v":5},{"$f":"VLOOKUP((Q38/AJ38),VSGMSG8!$B$18:$I$23,7)","v":5},{"$f":"VLOOKUP((Q38/AJ38),VSGMSG8!$B$24:$I$29,7)","v":5},{"$f":"VLOOKUP((Q38/AJ38),LVL!A$5:F$14,5)","v":6},{"$f":"VLOOKUP((Q38/AJ38),LVL!A$15:F$26,5)","v":5},{"$f":"VLOOKUP((Q38/AJ38),LVL!A$27:F$33,5)","v":2},{"$f":"VLOOKUP((Q38/AJ38),Glulam!$A$5:$D$20,4)","v":4},{"$f":"VLOOKUP((Q38/AJ38),Glulam!$A$12:$D$20,4)","v":4},{"$f":"VLOOKUP(Q38,Steel!$E$64:$G$84,3)","v":2},{"$f":"VLOOKUP(Q38,Steel!$E$26:$G$35,3)","v":3},{"$f":"VLOOKUP(Q38,Flitch!$A$5:$F$10,6)","v":1},{"$f":"VLOOKUP(Q38,Flitch!$A$44:$F$54,6)","v":2},null,null,0.8,{"$f":"$R38*1000/'Basic data'!I$21","v":1046.5460358706282},{"$f":"$R38*1000/'Basic data'!J$21","v":2116.6099601877872}]
[7,"1.2G+yQ+W",{"$f":"VLOOKUP('Basic data'!M$5,'Basic data'!$G$7:$Y$14,7)","v":0.85},null,0,null,{"$f":"VLOOKUP('Basic data'!I$5,'Basic data'!$G$7:$Y$14,3)*'Basic data'!D$19*'Basic data'!F$19*'Basic data'!G$19","v":0.23199999999999998},{"$f":"VLOOKUP('Basic data'!I$5,'Basic data'!$G$7:$Y$14,3)*'Basic data'!E$19*'Basic data'!F$19*'Basic data'!G$19","v":0.57999999999999996},{"$f":"VLOOKUP('Basic data'!O$5,'Basic data'!$G$7:$Y$14,9)","v":0.2},null,{"$f":"'Basic data'!S$7","v":0.4},null,{"$f":"0.4*(MAX(MIN(1,0.3+3/('Input beam data'!$E$15*'Input beam data'!$K$21)^0.5),0.5))*VLOOKUP('Basic data'!Q$5,'Basic data'!G$7:Y$14,11)","v":0.60000000000000009},null,{"$f":"('Input beam data'!$K$15+'Input beam data'!$O$17)*(1.2*C39/VLOOKUP('Basic data'!V$5,'Basic data'!$G$7:$Y$14,16)+H39)+1.2*I39*VLOOKUP('Basic data'!Y$5,'Basic data'!G$7:Y$14,19)+'Input beam data'!$K$21*(1.2*Calc!K39+Calc!M39)","v":8.1415524304475397},{"$f":"IF('Input beam data'!X$23=0,1.2*'Input beam data'!X$17+0+'Input beam data'!X$20,'Input beam data'!X$23)","v":0},{"$f":"MAX(O39*Span^2/8+P39*MIN('Input beam data'!X$16,(Span-'Input beam data'!X$16))/2,P39*'Input beam data'!X$16*(Span-'Input beam data'!X$16)/Span+O39*Span*MIN('Input beam data'!X$16,(Span-'Input beam data'!X$16))/2*(1-MIN('Input beam data'!X$16,(Span-'Input beam data'!X$16))/Span))","v":9.1592464842534831},{"$f":"O39*'Input beam data'!$E$15/2+P39*MAX('Input beam data'!X$16,(Span-'Input beam data'!X$16))/Span","v":12.21232864567131},null,null,{"$f":"VLOOKUP((Q39/AJ39),VSGMSG8!$B$5:$I$11,7)","v":6},{"$f":"VLOOKUP((Q39/AJ39),VSGMSG8!$B$12:$I$17,7)","v":4},{"$f":"VLOOKUP((Q39/AJ39),VSGMSG8!$B$18:$I$23,7)","v":3},{"$f":"VLOOKUP((Q39/AJ39),VSGMSG8!$B$24:$I$29,7)","v":3},{"$f":"VLOOKUP((Q39/AJ39),LVL!A$5:F$14,5)","v":5},{"$f":"VLOOKUP((Q39/AJ39),LVL!A$15:F$26,5)","v":3},{"$f":"VLOOKUP((Q39/AJ39),LVL!A$27:F$33,5)","v":0},{"$f":"VLOOKUP((Q39/AJ39),Glulam!$A$5:$D$20,4)","v":2},{"$f":"VLOOKUP((Q39/AJ39),Glulam!$A$12:$D$20,4)","v":2},{"$f":"VLOOKUP(Q39,Steel!$E$64:$G$84,3)","v":1},{"$f":"VLOOKUP(Q39,Steel!$E$26:$G$35,3)","v":2},{"$f":"VLOOKUP(Q39,Flitch!$A$5:$F$10,6)","v":1},{"$f":"VLOOKUP(Q39,Flitch!$A$44:$F$54,6)","v":1},null,null,1,{"$f":"$R39*1000/'Basic data'!I$21","v":678.46270253729506},{"$f":"$R39*1000/'Basic data'!J$21","v":1372.1717579405965}]
[8,".9G+W",{"$f":"VLOOKUP((2+'Basic data'!M$5),'Basic data'!$G$7:$Y$14,7)","v":0.4},null,null,null,{"$f":"VLOOKUP('Basic data'!I$5,'Basic data'!$G$7:$Y$14,3)*'Basic data'!D$20*'Basic data'!F$20*'Basic data'!G$20","v":1.8559999999999999},{"$f":"VLOOKUP('Basic data'!I$5,'Basic data'!$G$7:$Y$14,3)*'Basic data'!E$20*'Basic data'!F$20*'Basic data'!G$20","v":1.1135999999999999},{"$f":"VLOOKUP((2+'Basic data'!O$5),'Basic data'!$G$7:$Y$14,9)","v":0.1},null,{"$f":"'Basic data'!S$7","v":0.4},null,0,null,{"$f":"LD*(0.9*C40/VLOOKUP('Basic data'!V$5,'Basic data'!$G$7:$Y$14,16)-H40)+Overhang*(0.9*C40/VLOOKUP('Basic data'!V$5,'Basic data'!$G$7:$Y$14,16)-G40)*((LD+Overhang/2)/LD)+0.9*I40*VLOOKUP('Basic data'!Y$5,'Basic data'!G$7:Y$14,19)+'Input beam data'!$K$21*(1.2*Calc!K40)","v":-0.82227854689087554},{"$f":"IF('Input beam data'!X$23=0,0.9*'Input beam data'!X$17+'Input beam data'!X$19,'Input beam data'!X$23)","v":0},{"$f":"MAX(ABS(O40*Span^2/8+P40*MIN('Input beam data'!X$16,(Span-'Input beam data'!X$16))/2),ABS(P40*'Input beam data'!X$16*(Span-'Input beam data'!X$16)/Span+O40*Span*MIN('Input beam data'!X$16,(Span-'Input beam data'!X$16))/2*(1-MIN('Input beam data'!X$16,(Span-'Input beam data'!X$16))/Span)))","v":0.92506336525223498},{"$f":"O40*'Input beam data'!$E$15/2+P40*MAX('Input beam data'!X$16,(Span-'Input beam data'!X$16))/Span","v":-1.2334178203363133},null,null,{"$f":"VLOOKUP((Q40/AJ40),VSGMSG8!$C$5:$H$11,6)","v":2},{"$f":"VLOOKUP((Q40/AJ40),VSGMSG8!$C$12:$H$17,6)","v":0},{"$f":"VLOOKUP((Q40/AJ40),VSGMSG8!$C$18:$H$23,6)","v":0},{"$f":"VLOOKUP((Q40/AJ40),VSGMSG8!$C$24:$H$29,6)","v":0},{"$f":"VLOOKUP((Q40/AJ40),LVL!B$5:F$14,4)","v":1},{"$f":"VLOOKUP((Q40/AJ40),LVL!B$15:F$26,4)","v":3},{"$f":"VLOOKUP((Q40/AJ40),LVL!B$27:F$33,4)","v":0},{"$f":"VLOOKUP((Q40/AJ40),Glulam!$A$5:$D$20,4)","v":0},{"$f":"VLOOKUP((Q40/AJ40),Glulam!$A$12:$D$20,4)","v":0},{"$f":"VLOOKUP(Q40,Steel!$D$39:$G$59,4)","v":1},{"$f":"VLOOKUP(Q40,Steel!$D$26:$G$35,4)","v":1},{"$f":"VLOOKUP(Q40,Flitch!$C$5:$F$10,4)","v":0},{"$f":"VLOOKUP(Q40,Flitch!$C$44:$F$54,4)","v":0},null,null,1,{"$f":"-$R40*1000/'Basic data'!I$21","v":68.52321224090629},{"$f":"-$R40*1000/'Basic data'!J$21","v":138.58627194790037}]
[9,"1.2G+yQ+S",{"$f":"VLOOKUP('Basic data'!M$5,'Basic data'!$G$7:$Y$14,7)","v":0.85},null,0,{"$f":"'Input beam data'!$O$9*VLOOKUP('Basic data'!$V$5,'Basic data'!$G$7:$Y$14,17)","v":0},null,null,{"$f":"VLOOKUP('Basic data'!O$5,'Basic data'!$G$7:$Y$14,9)","v":0.2},null,{"$f":"'Basic data'!S$7","v":0.4},null,{"$f":"0.4*(MAX(MIN(1,0.3+3/('Input beam data'!$E$15*'Input beam data'!$K$21)^0.5),0.5))*VLOOKUP('Basic data'!Q$5,'Basic data'!G$7:Y$14,11)","v":0.60000000000000009},null,{"$f":"('Input beam data'!$K$15+'Input beam data'!$O$17)*(1.2*C41/VLOOKUP('Basic data'!V$5,'Basic data'!$G$7:$Y$14,16)+F41)+1.2*I41*VLOOKUP('Basic data'!Y$5,'Basic data'!G$7:Y$14,19)+'Input beam data'!$K$21*(1.2*Calc!K41+Calc!M41)","v":6.6335524304475406},{"$f":"IF('Input beam data'!X$23=0,1.2*'Input beam data'!X$17+0+1.2*'Input beam data'!X$21,'Input beam data'!X$23)","v":0},{"$f":"MAX(O41*Span^2/8+P41*MIN('Input beam data'!X$16,(Span-'Input beam data'!X$16))/2,P41*'Input beam data'!X$16*(Span-'Input beam data'!X$16)/Span+O41*Span*MIN('Input beam data'!X$16,(Span-'Input beam data'!X$16))/2*(1-MIN('Input beam data'!X$16,(Span-'Input beam data'!X$16))/Span))","v":7.4627464842534827},{"$f":"O41*'Input beam data'!$E$15/2+P41*MAX('Input beam data'!X$16,(Span-'Input beam data'!X$16))/Span","v":9.9503286456713109},null,null,{"$f":"VLOOKUP((Q41/AJ41),VSGMSG8!$B$5:$I$11,7)","v":6},{"$f":"VLOOKUP((Q41/AJ41),VSGMSG8!$B$12:$I$17,7)","v":4},{"$f":"VLOOKUP((Q41/AJ41),VSGMSG8!$B$18:$I$23,7)","v":3},{"$f":"VLOOKUP((Q41/AJ41),VSGMSG8!$B$24:$I$29,7)","v":3},{"$f":"VLOOKUP((Q41/AJ41),LVL!A$5:F$14,5)","v":5},{"$f":"VLOOKUP((Q41/AJ41),LVL!A$15:F$26,5)","v":3},{"$f":"VLOOKUP((Q41/AJ41),LVL!A$27:F$33,5)","v":0},{"$f":"VLOOKUP((Q41/AJ41),Glulam!$A$5:$D$20,4)","v":3},{"$f":"VLOOKUP((Q41/AJ41),Glulam!$A$12:$D$20,4)","v":3},{"$f":"VLOOKUP(Q41,Steel!$E$64:$G$84,3)","v":1},{"$f":"VLOOKUP(Q41,Steel!$E$26:$G$35,3)","v":2},{"$f":"VLOOKUP(Q41,Flitch!$A$5:$F$10,6)","v":1},{"$f":"VLOOKUP(Q41,Flitch!$A$44:$F$54,6)","v":1},null,null,0.8,{"$f":"$R41*1000/'Basic data'!I$21","v":552.79603587062832},{"$f":"$R41*1000/'Basic data'!J$21","v":1118.0144545698101}]
[null,null,null,null,null,null,null,null,null,null,null,null,null,null,null,null,"Min:",{"$f":"MIN(R33:R41)","v":-1.2334178203363133},null,"Max:",{"$f":"MAX(U33:U41)","v":6},5,5,5,6,6,2,4,4,2,3,{"$f":"MAX(AF33:AF41)","v":1},{"$f":"MAX(AG33:AG41)","v":2},null,null,null,{"$f":"MAX(AK33:AK41)","v":1046.5460358706282},{"$f":"MAX(AL33:AL41)","v":2116.6099601877872}]
["Application 4.  Veranda beam",null,null,null,null,null,null,null,"(dry props)"]
[null,null,"Basic loads"]
[null,null,"Roof",null,null,null,null,null,"Upper wall","Lower wall","Floor/deck",null,null,null,"Actions",null,null,null,null,null,"Size index's",null,null,null,null,null,null,null,null,null,null,null,null,"Deflection limits",null,"Strength"]
["Load case",null,"G","Ql","Qs","S","W(e)","W(r)","G","G","G","Ql","Qs","S","UDL",null,"M*","V*","EI(s)","EI(a)","MSG8",null,null,null,"LVL",null,null,"GL",null,"UB","MSC","Flitch",null,"(span/)","(mm)","dur. fact."]
[1,"G+Ql",{"$f":"VLOOKUP('Basic data'!M$5,'Basic data'!$G$7:$Y$14,7)","v":0.85},0,null,null,null,null,null,null,null,null,null,null,{"$f":"('Input beam data'!$K$15+'Input beam data'!$O$17)*(C47/VLOOKUP('Basic data'!V$5,'Basic data'!$G$7:$Y$14,16)+D47)","v":2.2879603587062833},null,null,null,{"$f":"(0.013*O47*Span^3+0.0298*P47*Span^2*(3*MIN('Input beam data'!X$16,Span-'Input beam data'!X$16)/Span-4*(MIN('Input beam data'!X$16,Span-'Input beam data'!X$16)/Span)^3))*AH47","v":240.92222577177159},{"$f":"(0.013*O47*Span^4+0.0208*P47*Span^3*(3*MIN('Input beam data'!X$16,Span-'Input beam data'!X$16)/Span-4*(MIN('Input beam data'!X$16,Span-'Input beam data'!X$16)/Span)^3))/(AI47/1000)","v":24.092222577177161},{"$f":"VLOOKUP(MAX(S47:T47),VSGMSG8!G$5:I$11,2)","v":5},{"$f":"VLOOKUP(MAX(S47:T47),VSGMSG8!G$12:I$17,2)","v":4},{"$f":"VLOOKUP(MAX(S47:T47),VSGMSG8!G$18:I$23,2)","v":3},{"$f":"VLOOKUP(MAX(S47:T47),VSGMSG8!G$24:I$29,2)","v":3},{"$f":"VLOOKUP(MAX(S47:T47),LVL!D$5:F$14,2)","v":5},{"$f":"VLOOKUP(MAX(S47:T47),LVL!D$15:F$26,2)","v":4},{"$f":"VLOOKUP(MAX(S47:T47),LVL!D$27:F$33,2)","v":1},{"$f":"VLOOKUP(MAX(S47:T47),Glulam!C$5:E$11,2)","v":2},{"$f":"VLOOKUP(MAX(S47:T47),Glulam!C$12:E$20,2)","v":2},{"$f":"VLOOKUP(MAX(S47:T47),Steel!$F$4:$H$24,2)","v":1},{"$f":"VLOOKUP(MAX(S47:T47),Steel!$F$26:$H$35,2)","v":1},{"$f":"VLOOKUP(MAX(S47:T47),Flitch!$E$5:$F$10,2)","v":0},{"$f":"VLOOKUP(MAX(S47:T47),Flitch!E$44:F$54,2)","v":0},300,100]
[2,"G+Qs",{"$f":"VLOOKUP('Basic data'!M$5,'Basic data'!$G$7:$Y$14,7)","v":0.85},null,{"$f":"0.7*'Basic data'!$M$11","v":0.17499999999999999},null,null,null,null,null,null,null,null,null,{"$f":"('Input beam data'!$K$15+'Input beam data'!$O$17)*(C48/VLOOKUP('Basic data'!V$5,'Basic data'!$G$7:$Y$14,16)+E48)","v":2.7429603587062834},null,null,null,{"$f":"(0.013*O48*Span^3+0.0298*P48*Span^2*(3*MIN('Input beam data'!X$16,Span-'Input beam data'!X$16)/Span-4*(MIN('Input beam data'!X$16,Span-'Input beam data'!X$16)/Span)^3))*AH48","v":288.83372577177158},{"$f":"(0.013*O48*Span^4+0.0208*P48*Span^3*(3*MIN('Input beam data'!X$16,Span-'Input beam data'!X$16)/Span-4*(MIN('Input beam data'!X$16,Span-'Input beam data'!X$16)/Span)^3))/(AI48/1000)","v":28.883372577177159},{"$f":"VLOOKUP(MAX(S48:T48),VSGMSG8!E$5:I$11,4)","v":5},{"$f":"VLOOKUP(MAX(S48:T48),VSGMSG8!E$12:I$17,4)","v":3},{"$f":"VLOOKUP(MAX(S48:T48),VSGMSG8!E$18:I$23,4)","v":2},{"$f":"VLOOKUP(MAX(S48:T48),VSGMSG8!E$24:I$29,4)","v":3},{"$f":"VLOOKUP(MAX(S48:T48),LVL!C$5:F$14,3)","v":4},{"$f":"VLOOKUP(MAX(S48:T48),LVL!C$15:F$26,3)","v":4},{"$f":"VLOOKUP(MAX(S48:T48),LVL!C$27:F$33,3)","v":1},{"$f":"VLOOKUP(MAX(S48:T48),Glulam!B$5:E$11,3)","v":2},{"$f":"VLOOKUP(MAX(S48:T48),Glulam!B$12:E$20,3)","v":1},{"$f":"VLOOKUP(MAX(S48:T48),Steel!$F$4:$H$24,2)","v":1},{"$f":"VLOOKUP(MAX(S48:T48),Steel!$F$26:$H$35,2)","v":1},{"$f":"VLOOKUP(MAX(S48:T48),Flitch!$D$5:$F$10,3)","v":0},{"$f":"VLOOKUP(MAX(S48:T48),Flitch!$D$44:$F$54,3)","v":0},300,100]
[3,"Spare"]
[4,"G+S",{"$f":"VLOOKUP('Basic data'!M$5,'Basic data'!$G$7:$Y$14,7)","v":0.85},null,0,{"$f":"0.68*'Input beam data'!$O$9*VLOOKUP('Basic data'!$V$5,'Basic data'!$G$7:$Y$14,17)","v":0},null,null,null,null,null,null,null,null,{"$f":"('Input beam data'!$K$15+'Input beam data'!$O$17)*(C50/VLOOKUP('Basic data'!V$5,'Basic data'!$G$7:$Y$14,16)+F50)","v":2.2879603587062833},null,null,null,{"$f":"(0.013*O50*Span^3+0.0298*P50*Span^2*(3*MIN('Input beam data'!X$16,Span-'Input beam data'!X$16)/Span-4*(MIN('Input beam data'!X$16,Span-'Input beam data'!X$16)/Span)^3))*AH50","v":240.92222577177159},{"$f":"(0.013*O50*Span^4+0.0208*P50*Span^3*(3*MIN('Input beam data'!X$16,Span-'Input beam data'!X$16)/Span-4*(MIN('Input beam data'!X$16,Span-'Input beam data'!X$16)/Span)^3))/(AI50/1000)","v":24.092222577177161},{"$f":"VLOOKUP(MAX(S50:T50),VSGMSG8!E$5:I$11,4)","v":4},{"$f":"VLOOKUP(MAX(S50:T50),VSGMSG8!E$12:I$17,4)","v":3},{"$f":"VLOOKUP(MAX(S50:T50),VSGMSG8!E$18:I$23,4)","v":2},{"$f":"VLOOKUP(MAX(S50:T50),VSGMSG8!E$24:I$29,4)","v":2},{"$f":"VLOOKUP(MAX(S50:T50),LVL!C$5:F$14,3)","v":4},{"$f":"VLOOKUP(MAX(S50:T50),LVL!C$15:F$26,3)","v":3},{"$f":"VLOOKUP(MAX(S50:T50),LVL!C$27:F$33,3)","v":1},{"$f":"VLOOKUP(MAX(S50:T50),Glulam!B$5:E$11,3)","v":1},{"$f":"VLOOKUP(MAX(S50:T50),Glulam!B$12:E$20,3)","v":1},{"$f":"VLOOKUP(MAX(S50:T50),Steel!$F$4:$H$24,2)","v":1},{"$f":"VLOOKUP(MAX(S50:T50),Steel!$F$26:$H$35,2)","v":1},{"$f":"VLOOKUP(MAX(S50:T50),Flitch!$D$5:$F$10,3)","v":0},{"$f":"VLOOKUP(MAX(S50:T50),Flitch!$D$44:$F$54,3)","v":0},300,100]
[5,"1.35G",{"$f":"VLOOKUP('Basic data'!M$5,'Basic data'!$G$7:$Y$14,7)","v":0.85},null,null,null,null,null,null,null,null,null,null,null,{"$f":"('Input beam data'!$K$15+'Input beam data'!$O$17)*(1.35*C51/VLOOKUP('Basic data'!V$5,'Basic data'!$G$7:$Y$14,16))","v":3.0887464842534826},null,{"$f":"MAX(O51*Span^2/8+P51*MIN('Input beam data'!X$16,(Span-'Input beam data'!X$16))/2,P51*'Input beam data'!X$16*(Span-'Input beam data'!X$16)/Span+O51*Span*MIN('Input beam data'!X$16,(Span-'Input beam data'!X$16))/2*(1-MIN('Input beam data'!X$16,(Span-'Input beam data'!X$16))/Span))","v":3.4748397947851681},{"$f":"O51*'Input beam data'!$E$15/2+P51*MAX('Input beam data'!X$16,(Span-'Input beam data'!X$16))/Span","v":4.6331197263802242},null,null,{"$f":"VLOOKUP((Q51/AJ51),VSGMSG8!$B$5:$I$11,7)","v":5},{"$f":"VLOOKUP((Q51/AJ51),VSGMSG8!$B$12:$I$17,7)","v":3},{"$f":"VLOOKUP((Q51/AJ51),VSGMSG8!$B$18:$I$23,7)","v":2},{"$f":"VLOOKUP((Q51/AJ51),VSGMSG8!$B$24:$I$29,7)","v":2},{"$f":"VLOOKUP((Q51/AJ51),LVL!A$5:F$14,5)","v":4},{"$f":"VLOOKUP((Q51/AJ51),LVL!A$15:F$26,5)","v":3},{"$f":"VLOOKUP((Q51/AJ51),LVL!A$27:F$33,5)","v":0},{"$f":"VLOOKUP((Q51/AJ51),Glulam!$A$5:$D$20,4)","v":1},{"$f":"VLOOKUP((Q51/AJ51),Glulam!$A$12:$D$20,4)","v":1},{"$f":"VLOOKUP(Q51,Steel!$C$4:$G$24,5)","v":1},{"$f":"VLOOKUP(Q51,Steel!$C$26:$G$35,5)","v":1},{"$f":"VLOOKUP(Q51,Flitch!$B$5:$F$10,5)","v":0},{"$f":"VLOOKUP(Q51,Flitch!$B$44:$F$54,5)","v":0},null,null,0.6,{"$f":"$R51*1000/'Basic data'!I$21","v":257.3955403544569},{"$f":"$R51*1000/'Basic data'!J$21","v":520.57525015508133}]
[6,"1.2G+1.5Q",{"$f":"VLOOKUP('Basic data'!M$5,'Basic data'!$G$7:$Y$14,7)","v":0.85},null,{"$f":"'Basic data'!M$11","v":0.25},null,null,null,null,null,null,null,null,null,{"$f":"('Input beam data'!$K$15+'Input beam data'!$O$17)*(1.2*C52/VLOOKUP('Basic data'!V$5,'Basic data'!$G$7:$Y$14,16)+1.5*E52)","v":3.7205524304475399},null,{"$f":"MAX(O52*Span^2/8+P52*MIN('Input beam data'!X$16,(Span-'Input beam data'!X$16))/2,P52*'Input beam data'!X$16*(Span-'Input beam data'!X$16)/Span+O52*Span*MIN('Input beam data'!X$16,(Span-'Input beam data'!X$16))/2*(1-MIN('Input beam data'!X$16,(Span-'Input beam data'!X$16))/Span))","v":4.185621484253482},{"$f":"O52*'Input beam data'!$E$15/2+P52*MAX('Input beam data'!X$16,(Span-'Input beam data'!X$16))/Span","v":5.5808286456713097},null,null,{"$f":"VLOOKUP((Q52/AJ52),VSGMSG8!$B$5:$I$11,7)","v":5},{"$f":"VLOOKUP((Q52/AJ52),VSGMSG8!$B$12:$I$17,7)","v":3},{"$f":"VLOOKUP((Q52/AJ52),VSGMSG8!$B$18:$I$23,7)","v":2},{"$f":"VLOOKUP((Q52/AJ52),VSGMSG8!$B$24:$I$29,7)","v":2},{"$f":"VLOOKUP((Q52/AJ52),LVL!A$5:F$14,5)","v":4},{"$f":"VLOOKUP((Q52/AJ52),LVL!A$15:F$26,5)","v":3},{"$f":"VLOOKUP((Q52/AJ52),LVL!A$27:F$33,5)","v":0},{"$f":"VLOOKUP((Q52/AJ52),Glulam!$A$5:$D$20,4)","v":1},{"$f":"VLOOKUP((Q52/AJ52),Glulam!$A$12:$D$20,4)","v":1},{"$f":"VLOOKUP(Q52,Steel!$C$4:$G$24,5)","v":1},{"$f":"VLOOKUP(Q52,Steel!$C$26:$G$35,5)","v":1},{"$f":"VLOOKUP(Q52,Flitch!$A$5:$F$10,6)","v":0},{"$f":"VLOOKUP(Q52,Flitch!$A$44:$F$54,6)","v":0},null,null,0.8,{"$f":"$R52*1000/'Basic data'!I$21","v":310.04603587062832},{"$f":"$R52*1000/'Basic data'!J$21","v":627.05939839003474}]
[7,"1.2G+yQ+W",{"$f":"VLOOKUP('Basic data'!M$5,'Basic data'!$G$7:$Y$14,7)","v":0.85},null,0,null,null,{"$f":"VLOOKUP('Basic data'!I$5,'Basic data'!$G$7:$Y$14,3)*'Basic data'!D$23*'Basic data'!F$23*'Basic data'!G$23","v":0.23199999999999998},null,null,null,null,null,null,{"$f":"('Input beam data'!$K$15+'Input beam data'!$O$17)*(1.2*C53/VLOOKUP('Basic data'!V$5,'Basic data'!$G$7:$Y$14,16)+H53)","v":3.34875243044754},null,{"$f":"MAX(O53*Span^2/8+P53*MIN('Input beam data'!X$16,(Span-'Input beam data'!X$16))/2,P53*'Input beam data'!X$16*(Span-'Input beam data'!X$16)/Span+O53*Span*MIN('Input beam data'!X$16,(Span-'Input beam data'!X$16))/2*(1-MIN('Input beam data'!X$16,(Span-'Input beam data'!X$16))/Span))","v":3.7673464842534825},{"$f":"O53*'Input beam data'!$E$15/2+P53*MAX('Input beam data'!X$16,(Span-'Input beam data'!X$16))/Span","v":5.02312864567131},null,null,{"$f":"VLOOKUP((Q53/AJ53),VSGMSG8!$B$5:$I$11,7)","v":4},{"$f":"VLOOKUP((Q53/AJ53),VSGMSG8!$B$12:$I$17,7)","v":2},{"$f":"VLOOKUP((Q53/AJ53),VSGMSG8!$B$18:$I$23,7)","v":2},{"$f":"VLOOKUP((Q53/AJ53),VSGMSG8!$B$24:$I$29,7)","v":2},{"$f":"VLOOKUP((Q53/AJ53),LVL!A$5:F$14,5)","v":3},{"$f":"VLOOKUP((Q53/AJ53),LVL!A$15:F$26,5)","v":3},{"$f":"VLOOKUP((Q53/AJ53),LVL!A$27:F$33,5)","v":0},{"$f":"VLOOKUP((Q53/AJ53),Glulam!$A$5:$D$20,4)","v":1},{"$f":"VLOOKUP((Q53/AJ53),Glulam!$A$12:$D$20,4)","v":1},{"$f":"VLOOKUP(Q53,Steel!$C$4:$G$24,5)","v":1},{"$f":"VLOOKUP(Q53,Steel!$C$26:$G$35,5)","v":1},{"$f":"VLOOKUP(Q53,Flitch!$A$5:$F$10,6)","v":0},{"$f":"VLOOKUP(Q53,Flitch!$A$44:$F$54,6)","v":0},null,null,1,{"$f":"$R53*1000/'Basic data'!I$21","v":279.06270253729497},{"$f":"$R53*1000/'Basic data'!J$21","v":564.39647704172012}]
[8,".9G+W",{"$f":"VLOOKUP((5+'Basic data'!M$5),'Basic data'!$G$7:$Y$14,7)","v":0.4},null,null,null,null,{"$f":"VLOOKUP('Basic data'!I$5,'Basic data'!$G$7:$Y$14,3)*'Basic data'!D$24*'Basic data'!F$24*'Basic data'!G$24","v":1.8559999999999999},null,null,null,null,null,null,{"$f":"('Input beam data'!$K$15+'Input beam data'!$O$17)*(0.9*C54/VLOOKUP('Basic data'!V$5,'Basic data'!$G$7:$Y$14,16)-H54)","v":-3.8565814951361621},null,{"$f":"MAX(ABS(O54*Span^2/8+P54*MIN('Input beam data'!X$16,(Span-'Input beam data'!X$16))/2),ABS(P54*'Input beam data'!X$16*(Span-'Input beam data'!X$16)/Span+O54*Span*MIN('Input beam data'!X$16,(Span-'Input beam data'!X$16))/2*(1-MIN('Input beam data'!X$16,(Span-'Input beam data'!X$16))/Span)))","v":4.3386541820281828},{"$f":"O54*'Input beam data'!$E$15/2+P54*MAX('Input beam data'!X$16,(Span-'Input beam data'!X$16))/Span","v":-5.7848722427042434},null,null,{"$f":"VLOOKUP((Q54/AJ54),VSGMSG8!$C$5:$H$11,6)","v":5},{"$f":"VLOOKUP((Q54/AJ54),VSGMSG8!$C$12:$H$17,6)","v":2},{"$f":"VLOOKUP((Q54/AJ54),VSGMSG8!$C$18:$H$23,6)","v":2},{"$f":"VLOOKUP((Q54/AJ54),VSGMSG8!$C$24:$H$29,6)","v":2},{"$f":"VLOOKUP((Q54/AJ54),LVL!B$5:F$14,4)","v":3},{"$f":"VLOOKUP((Q54/AJ54),LVL!B$15:F$26,4)","v":3},{"$f":"VLOOKUP((Q54/AJ54),LVL!B$27:F$33,4)","v":0},{"$f":"VLOOKUP((Q54/AJ54),Glulam!$A$5:$D$20,4)","v":1},{"$f":"VLOOKUP((Q54/AJ54),Glulam!$A$12:$D$20,4)","v":1},{"$f":"VLOOKUP(Q54,Steel!$C$4:$G$24,5)","v":1},{"$f":"VLOOKUP(Q54,Steel!$C$26:$G$35,5)","v":1},{"$f":"VLOOKUP(Q54,Flitch!$C$5:$F$10,4)","v":0},{"$f":"VLOOKUP(Q54,Flitch!$C$44:$F$54,4)","v":0},null,null,1,{"$f":"-$R54*1000/'Basic data'!I$21","v":321.38179126134685},{"$f":"-$R54*1000/'Basic data'!J$21","v":649.98564524766778}]
[9,"1.2G+yQ+S",{"$f":"VLOOKUP('Basic data'!M$5,'Basic data'!$G$7:$Y$14,7)","v":0.85},null,0,{"$f":"'Input beam data'!$O$9*VLOOKUP('Basic data'!$V$5,'Basic data'!$G$7:$Y$14,17)","v":0},null,null,null,null,null,null,null,null,{"$f":"('Input beam data'!$K$15+'Input beam data'!$O$17)*(1.2*C55/VLOOKUP('Basic data'!V$5,'Basic data'!$G$7:$Y$14,16)+F55)","v":2.7455524304475403},null,{"$f":"MAX(O55*Span^2/8+P55*MIN('Input beam data'!X$16,(Span-'Input beam data'!X$16))/2,P55*'Input beam data'!X$16*(Span-'Input beam data'!X$16)/Span+O55*Span*MIN('Input beam data'!X$16,(Span-'Input beam data'!X$16))/2*(1-MIN('Input beam data'!X$16,(Span-'Input beam data'!X$16))/Span))","v":3.0887464842534826},{"$f":"O55*'Input beam data'!$E$15/2+P55*MAX('Input beam data'!X$16,(Span-'Input beam data'!X$16))/Span","v":4.1183286456713102},null,null,{"$f":"VLOOKUP((Q55/AJ55),VSGMSG8!$B$5:$I$11,7)","v":4},{"$f":"VLOOKUP((Q55/AJ55),VSGMSG8!$B$12:$I$17,7)","v":2},{"$f":"VLOOKUP((Q55/AJ55),VSGMSG8!$B$18:$I$23,7)","v":2},{"$f":"VLOOKUP((Q55/AJ55),VSGMSG8!$B$24:$I$29,7)","v":2},{"$f":"VLOOKUP((Q55/AJ55),LVL!A$5:F$14,5)","v":3},{"$f":"VLOOKUP((Q55/AJ55),LVL!A$15:F$26,5)","v":3},{"$f":"VLOOKUP((Q55/AJ55),LVL!A$27:F$33,5)","v":0},{"$f":"VLOOKUP((Q55/AJ55),Glulam!$A$5:$D$20,4)","v":1},{"$f":"VLOOKUP((Q55/AJ55),Glulam!$A$12:$D$20,4)","v":1},{"$f":"VLOOKUP(Q55,Steel!$C$4:$G$24,5)","v":1},{"$f":"VLOOKUP(Q55,Steel!$C$26:$G$35,5)","v":1},{"$f":"VLOOKUP(Q55,Flitch!$A$5:$F$10,6)","v":0},{"$f":"VLOOKUP(Q55,Flitch!$A$44:$F$54,6)","v":0},null,null,0.8,{"$f":"$R55*1000/'Basic data'!I$21","v":228.79603587062834},{"$f":"$R55*1000/'Basic data'!J$21","v":462.73355569340566}]
[null,null,null,null,null,null,null,null,null,null,null,null,null,null,null,null,"Min:",{"$f":"MIN(R47:R55)","v":-5.7848722427042434},null,"Max:",{"$f":"MAX(U47:U55)","v":5},4,3,3,5,4,1,2,2,1,1,{"$f":"MAX(AF47:AF55)","v":0},{"$f":"MAX(AG47:AG55)","v":0},null,null,null,{"$f":"MAX(AK47:AK55)","v":321.38179126134685},{"$f":"MAX(AL47:AL55)","v":649.98564524766778}]
["Application 5.  Floor beam",null,null,null,null,null,null,"(dry props)"]
[null,null,"Basic loads"]
[null,null,"Roof",null,null,null,null,null,"Upper wall","Lower wall","Floor/deck",null,null,null,"Actions",null,null,null,null,null,"Size index's",null,null,null,null,null,null,null,null,null,null,null,null,"Deflection limits",null,"Strength"]
["Load case",null,"G","Ql","Qs","S","W(e)","W(r)","G","G","G","Ql","Qs","S","UDL","P","M*","V*","EI(s)","EI(a)","MSG8",null,null,null,"LVL",null,null,"GL",null,"UB","MSC","Flitch",null,"(span/)","(mm)","dur. fact."]
[1,"G+Ql",null,null,null,null,null,null,null,null,{"$f":"'Basic data'!S$7","v":0.4},{"$f":"0.4*(MAX(MIN(1,0.3+3/('Input beam data'!$E$15*'Input beam data'!$K$15)^0.5),0.5))*VLOOKUP('Basic data'!Q$5,'Basic data'!G$7:Y$14,11)","v":0.60000000000000009},null,null,{"$f":"'Input beam data'!$K$15*(K61+L61)","v":2},{"$f":"IF('Input beam data'!X$23=0,'Input beam data'!X$17+0.4*'Input beam data'!X$18,'Input beam data'!X$23)","v":0},null,null,{"$f":"(0.013*O61*Span^3+0.0298*P61*Span^2*(3*MIN('Input beam data'!X$16,Span-'Input beam data'!X$16)/Span-4*(MIN('Input beam data'!X$16,Span-'Input beam data'!X$16)/Span)^3))*AH61","v":210.6},{"$f":"(0.013*O61*Span^4+0.0208*P61*Span^3*(3*MIN('Input beam data'!X$16,Span-'Input beam data'!X$16)/Span-4*(MIN('Input beam data'!X$16,Span-'Input beam data'!X$16)/Span)^3))/(AI61/1000)","v":21.06},{"$f":"VLOOKUP(MAX(S61:T61),VSGMSG8!G$5:I$11,2)","v":5},{"$f":"VLOOKUP(MAX(S61:T61),VSGMSG8!G$12:I$17,2)","v":3},{"$f":"VLOOKUP(MAX(S61:T61),VSGMSG8!G$18:I$23,2)","v":3},{"$f":"VLOOKUP(MAX(S61:T61),VSGMSG8!G$24:I$29,2)","v":3},{"$f":"VLOOKUP(MAX(S61:T61),LVL!D$5:F$14,2)","v":4},{"$f":"VLOOKUP(MAX(S61:T61),LVL!D$15:F$26,2)","v":4},{"$f":"VLOOKUP(MAX(S61:T61),LVL!D$27:F$33,2)","v":1},{"$f":"VLOOKUP(MAX(S61:T61),Glulam!C$5:E$11,2)","v":2},{"$f":"VLOOKUP(MAX(S61:T61),Glulam!C$12:E$20,2)","v":1},{"$f":"VLOOKUP(MAX(S61:T61),Steel!$F$4:$H$24,2)","v":1},{"$f":"VLOOKUP(MAX(S61:T61),Steel!$F$26:$H$35,2)","v":1},{"$f":"VLOOKUP(MAX(S61:T61),Flitch!$E$5:$F$10,2)","v":0},{"$f":"VLOOKUP(MAX(S61:T61),Flitch!E$44:F$54,2)","v":0},300,100]
[2,"G+Qs",null,null,null,null,null,null,null,null,{"$f":"'Basic data'!S$7","v":0.4},null,{"$f":"0.7*(MAX(MIN(1,0.3+3/('Input beam data'!$E$15*'Input beam data'!$K$15)^0.5),0.5))*VLOOKUP('Basic data'!Q$5,'Basic data'!G$7:Y$14,11)","v":1.0499999999999998},null,{"$f":"'Input beam data'!$K$15*(K62+M62)","v":2.8999999999999995},{"$f":"IF('Input beam data'!X$23=0,'Input beam data'!X$17+0.7*'Input beam data'!X$18,'Input beam data'!X$23)","v":0},null,null,{"$f":"(0.013*O62*Span^3+0.0298*P62*Span^2*(3*MIN('Input beam data'!X$16,Span-'Input beam data'!X$16)/Span-4*(MIN('Input beam data'!X$16,Span-'Input beam data'!X$16)/Span)^3))*AH62","v":305.36999999999995},{"$f":"(0.013*O62*Span^4+0.0208*P62*Span^3*(3*MIN('Input beam data'!X$16,Span-'Input beam data'!X$16)/Span-4*(MIN('Input beam data'!X$16,Span-'Input beam data'!X$16)/Span)^3))/(AI62/1000)","v":30.536999999999992},{"$f":"VLOOKUP(MAX(S62:T62),VSGMSG8!E$5:I$11,4)","v":5},{"$f":"VLOOKUP(T63,VSGMSG8!E$12:I$17,4)","v":4},{"$f":"VLOOKUP(MAX(S62:T62),VSGMSG8!E$18:I$23,4)","v":2},{"$f":"VLOOKUP(MAX(S62:T62),VSGMSG8!E$24:I$29,4)","v":3},{"$f":"VLOOKUP(MAX(S62:T62),LVL!C$5:F$14,3)","v":4},{"$f":"VLOOKUP(MAX(S62:T62),LVL!C$15:F$26,3)","v":4},{"$f":"VLOOKUP(MAX(S62:T62),LVL!C$27:F$33,3)","v":1},{"$f":"VLOOKUP(MAX(S62:T62),Glulam!B$5:E$11,3)","v":2},{"$f":"VLOOKUP(MAX(S62:T62),Glulam!B$12:E$20,3)","v":1},{"$f":"VLOOKUP(MAX(S62:T62),Steel!$F$4:$H$24,2)","v":1},{"$f":"VLOOKUP(MAX(S62:T62),Steel!$F$26:$H$35,2)","v":1},{"$f":"VLOOKUP(MAX(S62:T62),Flitch!$D$5:$F$10,3)","v":0},{"$f":"VLOOKUP(MAX(S62:T62),Flitch!$D$44:$F$54,3)","v":0},300,100]
[3,"Vibration",null,null,null,null,null,null,null,null,null,null,null,null,null,null,null,null,null,{"$f":"1*Span^3/(48*(AI63/1000))","v":562.5},{"$f":"VLOOKUP(T63,VSGMSG8!E$5:I$11,4)","v":6},{"$f":"VLOOKUP(MAX(S63:T63),VSGMSG8!E$12:I$17,4)","v":4},{"$f":"VLOOKUP(T63,VSGMSG8!E$18:I$23,4)","v":3},{"$f":"VLOOKUP(T63,VSGMSG8!E$24:I$29,4)","v":4},{"$f":"VLOOKUP(T63,LVL!C$5:F$14,3)","v":6},{"$f":"VLOOKUP(T63,LVL!C$15:F$26,3)","v":5},{"$f":"VLOOKUP(T63,LVL!C$27:F$33,3)","v":1},{"$f":"VLOOKUP(T63,Glulam!B$5:E$11,3)","v":3},{"$f":"VLOOKUP(T63,Glulam!B$12:E$20,3)","v":2},{"$f":"VLOOKUP(T63,Steel!$F$4:$H$24,2)","v":1},{"$f":"VLOOKUP(T63,Steel!$F$26:$H$35,2)","v":2},{"$f":"VLOOKUP(MAX(S63:T63),Flitch!$D$5:$F$10,3)","v":1},{"$f":"VLOOKUP(T63,Flitch!$D$44:$F$54,3)","v":1},null,1]
[4,"G+S",null,null,null,null,null,null,null,null,null,null,null,null,null,null,null,null,null,null,null,null,null,null,null,null,null,null,null,null,null,null,null,300,100]
[5,"1.35G",null,null,null,null,null,null,null,null,{"$f":"'Basic data'!S$7","v":0.4},null,0,null,{"$f":"1.35*'Input beam data'!$K$15*K65","v":1.08},{"$f":"IF('Input beam data'!X$23=0,1.35*'Input beam data'!X$17,'Input beam data'!X$23)","v":0},{"$f":"MAX(O65*Span^2/8+P65*MIN('Input beam data'!X$16,(Span-'Input beam data'!X$16))/2,P65*'Input beam data'!X$16*(Span-'Input beam data'!X$16)/Span+O65*Span*MIN('Input beam data'!X$16,(Span-'Input beam data'!X$16))/2*(1-MIN('Input beam data'!X$16,(Span-'Input beam data'!X$16))/Span))","v":1.2150000000000001},{"$f":"O65*'Input beam data'!$E$15/2+P65*MAX('Input beam data'!X$16,(Span-'Input beam data'!X$16))/Span","v":1.62},null,null,{"$f":"VLOOKUP((Q65/AJ65),VSGMSG8!$B$5:$I$11,7)","v":3},{"$f":"VLOOKUP((Q65/AJ65),VSGMSG8!$B$12:$I$17,7)","v":1},{"$f":"VLOOKUP((Q65/AJ65),VSGMSG8!$B$18:$I$23,7)","v":1},{"$f":"VLOOKUP((Q65/AJ65),VSGMSG8!$B$24:$I$29,7)","v":1},{"$f":"VLOOKUP((Q65/AJ65),LVL!A$5:F$14,5)","v":1},{"$f":"VLOOKUP((Q65/AJ65),LVL!A$15:F$26,5)","v":3},{"$f":"VLOOKUP((Q65/AJ65),LVL!A$27:F$33,5)","v":0},{"$f":"VLOOKUP((Q65/AJ65),Glulam!$A$5:$D$20,4)","v":0},{"$f":"VLOOKUP((Q65/AJ65),Glulam!$A$12:$D$20,4)","v":0},{"$f":"VLOOKUP(Q65,Steel!$C$4:$G$24,5)","v":1},{"$f":"VLOOKUP(Q65,Steel!$C$26:$G$35,5)","v":1},{"$f":"VLOOKUP(Q65,Flitch!$B$5:$F$10,5)","v":0},{"$f":"VLOOKUP(Q65,Flitch!$B$44:$F$54,5)","v":0},null,null,0.6,30,60.674157303370784]
[6,"1.2G+1.5Q",null,null,null,null,null,null,null,null,{"$f":"'Basic data'!S$7","v":0.4},null,{"$f":"(MAX(MIN(1,0.3+3/('Input beam data'!$E$15*'Input beam data'!$K$15)^0.5),0.5))*VLOOKUP('Basic data'!Q$5,'Basic data'!G$7:Y$14,11)","v":1.5},null,{"$f":"'Input beam data'!$K$15*(1.2*K66+1.5*M66)","v":5.46},{"$f":"IF('Input beam data'!X$23=0,1.2*'Input beam data'!X$17+1.5*'Input beam data'!X$18,'Input beam data'!X$23)","v":0},{"$f":"MAX(O66*Span^2/8+P66*MIN('Input beam data'!X$16,(Span-'Input beam data'!X$16))/2,P66*'Input beam data'!X$16*(Span-'Input beam data'!X$16)/Span+O66*Span*MIN('Input beam data'!X$16,(Span-'Input beam data'!X$16))/2*(1-MIN('Input beam data'!X$16,(Span-'Input beam data'!X$16))/Span))","v":6.1425000000000001},{"$f":"O66*'Input beam data'!$E$15/2+P66*MAX('Input beam data'!X$16,(Span-'Input beam data'!X$16))/Span","v":8.19},null,null,{"$f":"VLOOKUP((Q66/AJ66),VSGMSG8!$B$5:$I$11,7)","v":6},{"$f":"VLOOKUP((Q66/AJ66),VSGMSG8!$B$12:$I$17,7)","v":4},{"$f":"VLOOKUP((Q66/AJ66),VSGMSG8!$B$18:$I$23,7)","v":3},{"$f":"VLOOKUP((Q66/AJ66),VSGMSG8!$B$24:$I$29,7)","v":3},{"$f":"VLOOKUP((Q66/AJ66),LVL!A$5:F$14,5)","v":4},{"$f":"VLOOKUP((Q66/AJ66),LVL!A$15:F$26,5)","v":3},{"$f":"VLOOKUP((Q66/AJ66),LVL!A$27:F$33,5)","v":0},{"$f":"VLOOKUP((Q66/AJ66),Glulam!$A$5:$D$20,4)","v":2},{"$f":"VLOOKUP((Q66/AJ66),Glulam!$A$12:$D$20,4)","v":2},{"$f":"VLOOKUP(Q66,Steel!$C$4:$G$24,5)","v":1},{"$f":"VLOOKUP(Q66,Steel!$C$26:$G$35,5)","v":1},{"$f":"VLOOKUP(Q66,Flitch!$A$5:$F$10,6)","v":0},{"$f":"VLOOKUP(Q66,Flitch!$A$44:$F$54,6)","v":0},null,null,0.8,193.33333333333334,391.01123595505618]
[7,"1.2G+yQ+W",null,null,null,null,null,null,null,null,null,null,null,null,null,null,null,null,null,null,null,null,null,null,null,null,null,null,null,null,null,null,null,null,null,1,0,0]
[8,".9G+W",null,null,null,null,null,null,null,null,null,null,null,null,null,null,null,null,null,null,null,null,null,null,null,null,null,null,null,null,null,null,null,null,null,1,0,0]
[9,"1.2G+yQ+S",null,null,null,null,null,null,null,null,null,null,null,null,null,null,null,null,null,null,null,null,null,null,null,null,null,null,null,null,null,null,null,null,null,0.8,0,0]
[null,null,null,null,null,null,null,null,null,null,null,null,null,null,null,null,"Min:",{"$f":"MIN(R61:R69)","v":1.62},null,"Max:",{"$f":"MAX(U61:U69)","v":6},4,3,4,6,5,1,3,2,1,2,{"$f":"MAX(AF61:AF69)","v":1},{"$f":"MAX(AG61:AG69)","v":1},null,null,null,{"$f":"MAX(AK61:AK69)","v":193.33333333333334},{"$f":"MAX(AL61:AL69)","v":391.01123595505618}]
["Application 6.  Deck bearer",null,null,null,null,null,null,"(green props)"]
[null,null,"Basic loads"]
[null,null,"Roof",null,null,null,null,null,"Upper wall","Lower wall","Floor/deck",null,null,null,"Actions",null,null,null,null,null,"Size index's",null,null,null,null,null,null,null,null,null,null,null,null,"Deflection limits",null,"Strength"]
["Load case",null,"G","Ql","Qs","S","W(e)","W(r)","G","G","G","Ql","Qs","S","UDL","P","M*","V*","EI(s)","EI(a)","MSG8",null,null,null,"LVL",null,null,"GL",null,"UB","MSC","Flitch",null,"(span/)","(mm)","dur. fact."]
[1,"G+Ql",null,null,null,null,null,null,null,null,{"$f":"'Basic data'!S$7","v":0.4},{"$f":"0.4*(MAX(MIN(1,0.3+3/('Input beam data'!$E$15*'Input beam data'!$K$15)^0.5),0.5))*2","v":0.8},null,null,{"$f":"'Input beam data'!$K$15*(Calc!K75+Calc!L75)","v":2.4000000000000004},{"$f":"IF('Input beam data'!X$23=0,'Input beam data'!X$17+0.4*'Input beam data'!X$18,'Input beam data'!X$23)","v":0},null,null,{"$f":"(0.013*O75*Span^3+0.0298*P75*Span^2*(3*MIN('Input beam data'!X$16,Span-'Input beam data'!X$16)/Span-4*(MIN('Input beam data'!X$16,Span-'Input beam data'!X$16)/Span)^3))*AH75","v":252.72},{"$f":"(0.013*O75*Span^4+0.0208*P75*Span^3*(3*MIN('Input beam data'!X$16,Span-'Input beam data'!X$16)/Span-4*(MIN('Input beam data'!X$16,Span-'Input beam data'!X$16)/Span)^3))/(AI75/1000)","v":25.271999999999998},{"$f":"VLOOKUP(MAX(S75:T75),VSGMSG8!F$5:I$11,3)","v":6},{"$f":"VLOOKUP(MAX(S75:T75),VSGMSG8!F$12:I$17,3)","v":4},{"$f":"VLOOKUP(MAX(S75:T75),VSGMSG8!F$18:I$23,3)","v":3},{"$f":"VLOOKUP(MAX(S75:T75),VSGMSG8!F$24:I$29,3)","v":4},null,null,null,null,null,{"$f":"VLOOKUP(MAX(S75:T75),Steel!$F$4:$H$24,2)","v":1},{"$f":"VLOOKUP(MAX(S75:T75),Steel!$F$26:$H$35,2)","v":1},null,null,300,100]
[2,"G+Qs",null,null,null,null,null,null,null,null,{"$f":"'Basic data'!S$7","v":0.4},null,{"$f":"0.7*(MAX(MIN(1,0.3+3/('Input beam data'!$E$15*'Input beam data'!$K$15)^0.5),0.5))*2","v":1.4},null,{"$f":"'Input beam data'!$K$15*(Calc!K76+Calc!M76)","v":3.5999999999999996},{"$f":"IF('Input beam data'!X$23=0,'Input beam data'!X$17+0.7*'Input beam data'!X$18,'Input beam data'!X$23)","v":0},null,null,{"$f":"(0.013*O76*Span^3+0.0298*P76*Span^2*(3*MIN('Input beam data'!X$16,Span-'Input beam data'!X$16)/Span-4*(MIN('Input beam data'!X$16,Span-'Input beam data'!X$16)/Span)^3))*AH76","v":379.07999999999993},{"$f":"(0.013*O76*Span^4+0.0208*P76*Span^3*(3*MIN('Input beam data'!X$16,Span-'Input beam data'!X$16)/Span-4*(MIN('Input beam data'!X$16,Span-'Input beam data'!X$16)/Span)^3))/(AI76/1000)","v":37.907999999999994},{"$f":"VLOOKUP(MAX(S76:T76),VSGMSG8!D$5:I$11,5)","v":5},{"$f":"VLOOKUP(MAX(S76:T76),VSGMSG8!D$12:I$17,5)","v":4},{"$f":"VLOOKUP(MAX(S76:T76),VSGMSG8!D$18:I$23,5)","v":3},{"$f":"VLOOKUP(MAX(S76:T76),VSGMSG8!D$24:I$29,5)","v":3},null,null,null,null,null,{"$f":"VLOOKUP(MAX(S76:T76),Steel!$F$4:$H$24,2)","v":1},{"$f":"VLOOKUP(MAX(S76:T76),Steel!$F$26:$H$35,2)","v":1},null,null,300,100]
[3,"Spare"]
[4,"G+S",null,null,null,null,null,null,null,null,{"$f":"'Basic data'!S$7","v":0.4},null,null,{"$f":"0.68*'Input beam data'!O9","v":0},{"$f":"'Input beam data'!$K$15*(K78+N78)","v":0.8},{"$f":"IF('Input beam data'!X$23=0,'Input beam data'!X$17+'Input beam data'!X$21,'Input beam data'!X$23)","v":0},null,null,{"$f":"(0.013*O78*Span^3+0.0298*P78*Span^2*(3*MIN('Input beam data'!X$16,Span-'Input beam data'!X$16)/Span-4*(MIN('Input beam data'!X$16,Span-'Input beam data'!X$16)/Span)^3))*AH78","v":84.24},{"$f":"(0.013*O78*Span^4+0.0208*P78*Span^3*(3*MIN('Input beam data'!X$16,Span-'Input beam data'!X$16)/Span-4*(MIN('Input beam data'!X$16,Span-'Input beam data'!X$16)/Span)^3))/(AI78/1000)","v":8.4239999999999995},{"$f":"VLOOKUP(MAX(S78:T78),VSGMSG8!D$5:I$11,5)","v":3},{"$f":"VLOOKUP(MAX(S78:T78),VSGMSG8!D$12:I$17,5)","v":2},{"$f":"VLOOKUP(MAX(S78:T78),VSGMSG8!D$18:I$23,5)","v":1},{"$f":"VLOOKUP(MAX(S78:T78),VSGMSG8!D$24:I$29,5)","v":1},null,null,null,null,null,{"$f":"VLOOKUP(MAX(S78:T78),Steel!$F$4:$H$24,2)","v":1},{"$f":"VLOOKUP(MAX(S78:T78),Steel!$F$26:$H$35,2)","v":1},null,null,300,100]
[5,"1.35G",null,null,null,null,null,null,null,null,{"$f":"'Basic data'!S$7","v":0.4},null,0,null,{"$f":"'Input beam data'!$K$15*(1.35*K79)","v":1.08},{"$f":"IF('Input beam data'!X$23=0,1.35*'Input beam data'!X$17,'Input beam data'!X$23)","v":0},{"$f":"MAX(O79*Span^2/8+P79*MIN('Input beam data'!X$16,(Span-'Input beam data'!X$16))/2,P79*'Input beam data'!X$16*(Span-'Input beam data'!X$16)/Span+O79*Span*MIN('Input beam data'!X$16,(Span-'Input beam data'!X$16))/2*(1-MIN('Input beam data'!X$16,(Span-'Input beam data'!X$16))/Span))","v":1.2150000000000001},{"$f":"O79*'Input beam data'!$E$15/2+P79*MAX('Input beam data'!X$16,(Span-'Input beam data'!X$16))/Span","v":1.62},null,null,{"$f":"VLOOKUP((Q79/AJ79),VSGMSG8!$A$5:$I$11,8)","v":3},{"$f":"VLOOKUP((Q79/AJ79),VSGMSG8!$A$12:$I$17,8)","v":1},{"$f":"VLOOKUP((Q79/AJ79),VSGMSG8!$A$18:$I$23,8)","v":1},{"$f":"VLOOKUP((Q79/AJ79),VSGMSG8!$A$24:$I$29,8)","v":1},null,null,null,null,null,{"$f":"VLOOKUP(Q79,Steel!$C$4:$G$24,5)","v":1},{"$f":"VLOOKUP(Q79,Steel!$C$26:$G$35,5)","v":1},null,null,null,null,0.6,45,101.88679245283019]
[6,"1.2G+1.5Q",null,null,null,null,null,null,null,null,{"$f":"'Basic data'!S$7","v":0.4},null,{"$f":"(MAX(MIN(1,0.3+3/('Input beam data'!$E$15*'Input beam data'!$K$15)^0.5),0.5))*2","v":2},null,{"$f":"'Input beam data'!$K$15*(1.2*K80+1.5*M80)","v":6.96},{"$f":"IF('Input beam data'!X$23=0,1.2*'Input beam data'!X$17+1.5*'Input beam data'!X$18,'Input beam data'!X$23)","v":0},{"$f":"MAX(O80*Span^2/8+P80*MIN('Input beam data'!X$16,(Span-'Input beam data'!X$16))/2,P80*'Input beam data'!X$16*(Span-'Input beam data'!X$16)/Span+O80*Span*MIN('Input beam data'!X$16,(Span-'Input beam data'!X$16))/2*(1-MIN('Input beam data'!X$16,(Span-'Input beam data'!X$16))/Span))","v":7.83},{"$f":"O80*'Input beam data'!$E$15/2+P80*MAX('Input beam data'!X$16,(Span-'Input beam data'!X$16))/Span","v":10.44},null,null,{"$f":"VLOOKUP((Q80/AJ80),VSGMSG8!$A$5:$I$11,8)","v":6},{"$f":"VLOOKUP((Q80/AJ80),VSGMSG8!$A$12:$I$17,8)","v":5},{"$f":"VLOOKUP((Q80/AJ80),VSGMSG8!$A$18:$I$23,8)","v":4},{"$f":"VLOOKUP((Q80/AJ80),VSGMSG8!$A$24:$I$29,8)","v":4},null,null,null,null,null,{"$f":"VLOOKUP(Q80,Steel!$C$4:$G$24,5)","v":1},{"$f":"VLOOKUP(Q80,Steel!$C$26:$G$35,5)","v":1},null,null,null,null,0.8,290,656.60377358490564]
[7,"1.2G+yQ+W",null,null,null,null,null,null,null,null,null,null,null,null,null,null,null,null,null,null,null,null,null,null,null,null,null,null,null,null,null,null,null,null,null,1,0,0]
[8,".9G+W",null,null,null,null,null,null,null,null,null,null,null,null,null,null,null,null,null,null,null,null,null,null,null,null,null,null,null,null,null,null,null,null,null,1,0,0]
[9,"1.2G+yQ+S",null,null,null,null,null,null,null,null,{"$f":"'Basic data'!S$7","v":0.4},null,{"$f":"0.7*(MAX(MIN(1,0.3+3/('Input beam data'!$E$15*'Input beam data'!$K$15)^0.5),0.5))*2","v":1.4},{"$f":"'Input beam data'!O9","v":0},{"$f":"'Input beam data'!$K$15*(1.2*K83+M83+N83)","v":3.76},{"$f":"IF('Input beam data'!X$23=0,1.2*'Input beam data'!X$17+0+1.2*'Input beam data'!X$21,'Input beam data'!X$23)","v":0},{"$f":"MAX(O83*Span^2/8+P83*MIN('Input beam data'!X$16,(Span-'Input beam data'!X$16))/2,P83*'Input beam data'!X$16*(Span-'Input beam data'!X$16)/Span+O83*Span*MIN('Input beam data'!X$16,(Span-'Input beam data'!X$16))/2*(1-MIN('Input beam data'!X$16,(Span-'Input beam data'!X$16))/Span))","v":4.2299999999999995},{"$f":"O83*'Input beam data'!$E$15/2+P83*MAX('Input beam data'!X$16,(Span-'Input beam data'!X$16))/Span","v":5.64},null,null,{"$f":"VLOOKUP((Q83/AJ83),VSGMSG8!$A$5:$I$11,8)","v":5},{"$f":"VLOOKUP((Q83/AJ83),VSGMSG8!$A$12:$I$17,8)","v":3},{"$f":"VLOOKUP((Q83/AJ83),VSGMSG8!$A$18:$I$23,8)","v":2},{"$f":"VLOOKUP((Q83/AJ83),VSGMSG8!$A$24:$I$29,8)","v":3},null,null,null,null,null,{"$f":"VLOOKUP(Q83,Steel!$C$4:$G$24,5)","v":1},{"$f":"VLOOKUP(Q83,Steel!$C$26:$G$35,5)","v":1},null,null,null,null,0.8,156.66666666666666,354.71698113207549]
[null,null,null,null,null,null,null,null,null,null,null,null,null,null,null,null,"Min:",{"$f":"MIN(R75:R83)","v":1.62},null,"Max:",{"$f":"MAX(U75:U83)","v":6},{"$f":"MAX(V75:V83)","v":5},{"$f":"MAX(W75:W83)","v":4},{"$f":"MAX(X75:X83)","v":4},null,null,null,null,null,{"$f":"MAX(AD75:AD83)","v":1},{"$f":"MAX(AE75:AE83)","v":1},null,null,null,null,null,{"$f":"MAX(AK75:AK83)","v":290},{"$f":"MAX(AL75:AL83)","v":656.60377358490564}]
["Application 7.  Roof beam",null,null,null,null,null,null,"(dry props)"]
[null,null,"Basic loads",null,null,null,null,null,null,null,null,null,null,null,"Note have ignored ceiling being on the horizontal plane for now"]
[null,null,"Roof",null,null,null,null,null,"Upper wall","Lower wall","Floor/deck",null,null,null,"Actions",null,null,null,null,null,"Size index's",null,null,null,null,null,null,null,null,null,null,null,null,"Deflection limits",null,"Strength"]
["Load case",null,"G","Ql","Qs","S","W(e)","W(r)","G","G","G","Ql","Qs","S","UDL","P","M*","V*","EI(s)","EI(a)","MSG8",null,null,null,"LVL",null,null,"GL",null,"UB","MSC","Flitch",null,"(span/)","(mm)","dur. fact."]
[1,"G+Ql",{"$f":"VLOOKUP('Basic data'!M$5,'Basic data'!$G$7:$Y$14,7)","v":0.85},0,null,null,null,null,null,null,null,null,null,null,{"$f":"('Input beam data'!$K$15)*(C89/VLOOKUP('Basic data'!V$5,'Basic data'!$G$7:$Y$14,16)+D89)","v":1.759969506697141},{"$f":"IF('Input beam data'!X$23=0,'Input beam data'!X$17,'Input beam data'!X$23)","v":0},null,null,{"$f":"(0.013*O89*Span^3+0.0298*P89*Span^2*(3*MIN('Input beam data'!X$16,Span-'Input beam data'!X$16)/Span-4*(MIN('Input beam data'!X$16,Span-'Input beam data'!X$16)/Span)^3))*AH89","v":185.32478905520892},{"$f":"(0.013*O89*Span^4+0.0208*P89*Span^3*(3*MIN('Input beam data'!X$16,Span-'Input beam data'!X$16)/Span-4*(MIN('Input beam data'!X$16,Span-'Input beam data'!X$16)/Span)^3))/(AI89/1000)","v":18.532478905520893},{"$f":"VLOOKUP(MAX(S89:T89),VSGMSG8!G$5:I$11,2)","v":5},{"$f":"VLOOKUP(MAX(S89:T89),VSGMSG8!G$12:I$17,2)","v":3},{"$f":"VLOOKUP(MAX(S89:T89),VSGMSG8!G$18:I$23,2)","v":3},{"$f":"VLOOKUP(MAX(S89:T89),VSGMSG8!G$24:I$29,2)","v":3},{"$f":"VLOOKUP(MAX(S89:T89),LVL!D$5:F$14,2)","v":4},{"$f":"VLOOKUP(MAX(S89:T89),LVL!D$15:F$26,2)","v":4},{"$f":"VLOOKUP(MAX(S89:T89),LVL!D$27:F$33,2)","v":1},{"$f":"VLOOKUP(MAX(S89:T89),Glulam!C$5:E$11,2)","v":2},{"$f":"VLOOKUP(MAX(S89:T89),Glulam!C$12:E$20,2)","v":1},{"$f":"VLOOKUP(MAX(S89:T89),Steel!$F$4:$H$24,2)","v":1},{"$f":"VLOOKUP(MAX(S89:T89),Steel!$F$26:$H$35,2)","v":1},{"$f":"VLOOKUP(MAX(S89:T89),Flitch!$E$5:$F$10,2)","v":0},{"$f":"VLOOKUP(MAX(S89:T89),Flitch!E$44:F$54,2)","v":0},300,100]
[2,"G+Qs",{"$f":"VLOOKUP('Basic data'!M$5,'Basic data'!$G$7:$Y$14,7)","v":0.85},null,{"$f":"0.7*'Basic data'!$M$11","v":0.17499999999999999},null,null,null,null,null,null,null,null,null,{"$f":"('Input beam data'!$K$15)*(C90/VLOOKUP('Basic data'!V$5,'Basic data'!$G$7:$Y$14,16)+E90)","v":2.1099695066971411},{"$f":"IF('Input beam data'!X$23=0,'Input beam data'!X$17+0.7*'Input beam data'!X$18,'Input beam data'!X$23)","v":0},null,null,{"$f":"(0.013*O90*Span^3+0.0298*P90*Span^2*(3*MIN('Input beam data'!X$16,Span-'Input beam data'!X$16)/Span-4*(MIN('Input beam data'!X$16,Span-'Input beam data'!X$16)/Span)^3))*AH90","v":222.17978905520894},{"$f":"(0.013*O90*Span^4+0.0208*P90*Span^3*(3*MIN('Input beam data'!X$16,Span-'Input beam data'!X$16)/Span-4*(MIN('Input beam data'!X$16,Span-'Input beam data'!X$16)/Span)^3))/(AI90/1000)","v":22.217978905520894},{"$f":"VLOOKUP(MAX(S90:T90),VSGMSG8!E$5:I$11,4)","v":4},{"$f":"VLOOKUP(MAX(S90:T90),VSGMSG8!E$12:I$17,4)","v":3},{"$f":"VLOOKUP(MAX(S90:T90),VSGMSG8!E$18:I$23,4)","v":2},{"$f":"VLOOKUP(MAX(S90:T90),VSGMSG8!E$24:I$29,4)","v":2},{"$f":"VLOOKUP(MAX(S90:T90),LVL!C$5:F$14,3)","v":4},{"$f":"VLOOKUP(MAX(S90:T90),LVL!C$15:F$26,3)","v":3},{"$f":"VLOOKUP(MAX(S90:T90),LVL!C$27:F$33,3)","v":0},{"$f":"VLOOKUP(MAX(S90:T90),Glulam!B$5:E$11,3)","v":1},{"$f":"VLOOKUP(MAX(S90:T90),Glulam!B$12:E$20,3)","v":1},{"$f":"VLOOKUP(MAX(S90:T90),Steel!$F$4:$H$24,2)","v":1},{"$f":"VLOOKUP(MAX(S90:T90),Steel!$F$26:$H$35,2)","v":1},{"$f":"VLOOKUP(MAX(S90:T90),Flitch!$D$5:$F$10,3)","v":0},{"$f":"VLOOKUP(MAX(S90:T90),Flitch!$D$44:$F$54,3)","v":0},300,100]
[3,"Spare"]
[4,"G+S",{"$f":"VLOOKUP('Basic data'!M$5,'Basic data'!$G$7:$Y$14,7)","v":0.85},null,0,{"$f":"0.68*'Input beam data'!$O$9*VLOOKUP('Basic data'!$V$5,'Basic data'!$G$7:$Y$14,17)","v":0},null,null,null,null,null,null,null,null,{"$f":"('Input beam data'!$K$15)*(C92/VLOOKUP('Basic data'!V$5,'Basic data'!$G$7:$Y$14,16)+F92)","v":1.759969506697141},{"$f":"IF('Input beam data'!X$23=0,'Input beam data'!X$17+'Input beam data'!X$21,'Input beam data'!X$23)","v":0},null,null,{"$f":"(0.013*O92*Span^3+0.0298*P92*Span^2*(3*MIN('Input beam data'!X$16,Span-'Input beam data'!X$16)/Span-4*(MIN('Input beam data'!X$16,Span-'Input beam data'!X$16)/Span)^3))*AH92","v":154.43732421267413},{"$f":"(0.013*O92*Span^4+0.0208*P92*Span^3*(3*MIN('Input beam data'!X$16,Span-'Input beam data'!X$16)/Span-4*(MIN('Input beam data'!X$16,Span-'Input beam data'!X$16)/Span)^3))/(AI92/1000)","v":18.532478905520893},{"$f":"VLOOKUP(MAX(S92:T92),VSGMSG8!E$5:I$11,4)","v":4},{"$f":"VLOOKUP(MAX(S92:T92),VSGMSG8!E$12:I$17,4)","v":2},{"$f":"VLOOKUP(MAX(S92:T92),VSGMSG8!E$18:I$23,4)","v":2},{"$f":"VLOOKUP(MAX(S92:T92),VSGMSG8!E$24:I$29,4)","v":2},{"$f":"VLOOKUP(MAX(S92:T92),LVL!C$5:F$14,3)","v":3},{"$f":"VLOOKUP(MAX(S92:T92),LVL!C$15:F$26,3)","v":3},{"$f":"VLOOKUP(MAX(S92:T92),LVL!C$27:F$33,3)","v":0},{"$f":"VLOOKUP(MAX(S92:T92),Glulam!B$5:E$11,3)","v":1},{"$f":"VLOOKUP(MAX(S92:T92),Glulam!B$12:E$20,3)","v":1},{"$f":"VLOOKUP(MAX(S92:T92),Steel!$F$4:$H$24,2)","v":1},{"$f":"VLOOKUP(MAX(S92:T92),Steel!$F$26:$H$35,2)","v":1},{"$f":"VLOOKUP(MAX(S92:T92),Flitch!$D$5:$F$10,3)","v":0},{"$f":"VLOOKUP(MAX(S92:T92),Flitch!$D$44:$F$54,3)","v":0},250,100]
[5,"1.35G",{"$f":"VLOOKUP('Basic data'!M$5,'Basic data'!$G$7:$Y$14,7)","v":0.85},null,null,null,null,null,null,null,null,null,null,null,{"$f":"('Input beam data'!$K$15)*(1.35*C93/VLOOKUP('Basic data'!V$5,'Basic data'!$G$7:$Y$14,16))","v":2.3759588340411404},{"$f":"IF('Input beam data'!X$23=0,1.35*'Input beam data'!X$17,'Input beam data'!X$23)","v":0},{"$f":"MAX(O93*Span^2/8+P93*MIN('Input beam data'!X$16,(Span-'Input beam data'!X$16))/2,P93*'Input beam data'!X$16*(Span-'Input beam data'!X$16)/Span+O93*Span*MIN('Input beam data'!X$16,(Span-'Input beam data'!X$16))/2*(1-MIN('Input beam data'!X$16,(Span-'Input beam data'!X$16))/Span))","v":2.6729536882962828},{"$f":"O93*'Input beam data'!$E$15/2+P93*MAX('Input beam data'!X$16,(Span-'Input beam data'!X$16))/Span","v":3.5639382510617104},null,null,{"$f":"VLOOKUP((Q93/AJ93),VSGMSG8!$B$5:$I$11,7)","v":4},{"$f":"VLOOKUP((Q93/AJ93),VSGMSG8!$B$12:$I$17,7)","v":2},{"$f":"VLOOKUP((Q93/AJ93),VSGMSG8!$B$18:$I$23,7)","v":2},{"$f":"VLOOKUP((Q93/AJ93),VSGMSG8!$B$24:$I$29,7)","v":2},{"$f":"VLOOKUP((Q93/AJ93),LVL!A$5:F$14,5)","v":3},{"$f":"VLOOKUP((Q93/AJ93),LVL!A$15:F$26,5)","v":3},{"$f":"VLOOKUP((Q93/AJ93),LVL!A$27:F$33,5)","v":0},{"$f":"VLOOKUP((Q93/AJ93),Glulam!$A$5:$D$20,4)","v":1},{"$f":"VLOOKUP((Q93/AJ93),Glulam!$A$12:$D$20,4)","v":1},{"$f":"VLOOKUP(Q93,Steel!$C$4:$G$24,5)","v":1},{"$f":"VLOOKUP(Q93,Steel!$C$26:$G$35,5)","v":1},{"$f":"VLOOKUP(Q93,Flitch!$B$5:$F$10,5)","v":0},{"$f":"VLOOKUP(Q93,Flitch!$B$44:$F$54,5)","v":0},null,null,0.6,30.46279835657235,61.610153979584531]
[6,"1.2G+1.5Q",{"$f":"VLOOKUP('Basic data'!M$5,'Basic data'!$G$7:$Y$14,7)","v":0.85},null,{"$f":"'Basic data'!M$11","v":0.25},null,null,null,null,null,null,null,null,null,{"$f":"('Input beam data'!$K$15)*(1.2*C94/VLOOKUP('Basic data'!V$5,'Basic data'!$G$7:$Y$14,16)+1.5*E94)","v":2.8619634080365692},{"$f":"IF('Input beam data'!X$23=0,1.2*'Input beam data'!X$17+1.5*'Input beam data'!X$18,'Input beam data'!X$23)","v":0},{"$f":"MAX(O94*Span^2/8+P94*MIN('Input beam data'!X$16,(Span-'Input beam data'!X$16))/2,P94*'Input beam data'!X$16*(Span-'Input beam data'!X$16)/Span+O94*Span*MIN('Input beam data'!X$16,(Span-'Input beam data'!X$16))/2*(1-MIN('Input beam data'!X$16,(Span-'Input beam data'!X$16))/Span))","v":3.2197088340411404},{"$f":"O94*'Input beam data'!$E$15/2+P94*MAX('Input beam data'!X$16,(Span-'Input beam data'!X$16))/Span","v":4.2929451120548539},null,null,{"$f":"VLOOKUP((Q94/AJ94),VSGMSG8!$B$5:$I$11,7)","v":4},{"$f":"VLOOKUP((Q94/AJ94),VSGMSG8!$B$12:$I$17,7)","v":2},{"$f":"VLOOKUP((Q94/AJ94),VSGMSG8!$B$18:$I$23,7)","v":2},{"$f":"VLOOKUP((Q94/AJ94),VSGMSG8!$B$24:$I$29,7)","v":2},{"$f":"VLOOKUP((Q94/AJ94),LVL!A$5:F$14,5)","v":3},{"$f":"VLOOKUP((Q94/AJ94),LVL!A$15:F$26,5)","v":3},{"$f":"VLOOKUP((Q94/AJ94),LVL!A$27:F$33,5)","v":0},{"$f":"VLOOKUP((Q94/AJ94),Glulam!$A$5:$D$20,4)","v":1},{"$f":"VLOOKUP((Q94/AJ94),Glulam!$A$12:$D$20,4)","v":1},{"$f":"VLOOKUP(Q94,Steel!$C$4:$G$24,5)","v":1},{"$f":"VLOOKUP(Q94,Steel!$C$26:$G$35,5)","v":1},{"$f":"VLOOKUP(Q94,Flitch!$A$5:$F$10,6)","v":0},{"$f":"VLOOKUP(Q94,Flitch!$A$44:$F$54,6)","v":0},null,null,0.8,47.911376316953209,96.899412775860412]
[7,"1.2G+yQ+W",{"$f":"VLOOKUP('Basic data'!M$5,'Basic data'!$G$7:$Y$14,7)","v":0.85},null,0,null,null,{"$f":"VLOOKUP('Basic data'!I$5,'Basic data'!$G$7:$Y$14,3)*'Basic data'!E$19*'Basic data'!F$19*'Basic data'!G$19","v":0.57999999999999996},null,null,null,null,null,null,{"$f":"('Input beam data'!$K$15)*(1.2*C95/VLOOKUP('Basic data'!V$5,'Basic data'!$G$7:$Y$14,16)+H95)","v":3.2719634080365694},{"$f":"IF('Input beam data'!X$23=0,1.2*'Input beam data'!X$17+0+'Input beam data'!X$20,'Input beam data'!X$23)","v":0},{"$f":"MAX(O95*Span^2/8+P95*MIN('Input beam data'!X$16,(Span-'Input beam data'!X$16))/2,P95*'Input beam data'!X$16*(Span-'Input beam data'!X$16)/Span+O95*Span*MIN('Input beam data'!X$16,(Span-'Input beam data'!X$16))/2*(1-MIN('Input beam data'!X$16,(Span-'Input beam data'!X$16))/Span))","v":3.6809588340411405},{"$f":"O95*'Input beam data'!$E$15/2+P95*MAX('Input beam data'!X$16,(Span-'Input beam data'!X$16))/Span","v":4.9079451120548541},null,null,{"$f":"VLOOKUP((Q95/AJ95),VSGMSG8!$B$5:$I$11,7)","v":4},{"$f":"VLOOKUP((Q95/AJ95),VSGMSG8!$B$12:$I$17,7)","v":2},{"$f":"VLOOKUP((Q95/AJ95),VSGMSG8!$B$18:$I$23,7)","v":1},{"$f":"VLOOKUP((Q95/AJ95),VSGMSG8!$B$24:$I$29,7)","v":2},{"$f":"VLOOKUP((Q95/AJ95),LVL!A$5:F$14,5)","v":3},{"$f":"VLOOKUP((Q95/AJ95),LVL!A$15:F$26,5)","v":3},{"$f":"VLOOKUP((Q95/AJ95),LVL!A$27:F$33,5)","v":0},{"$f":"VLOOKUP((Q95/AJ95),Glulam!$A$5:$D$20,4)","v":1},{"$f":"VLOOKUP((Q95/AJ95),Glulam!$A$12:$D$20,4)","v":1},{"$f":"VLOOKUP(Q95,Steel!$C$4:$G$24,5)","v":1},{"$f":"VLOOKUP(Q95,Steel!$C$26:$G$35,5)","v":1},{"$f":"VLOOKUP(Q95,Flitch!$A$5:$F$10,6)","v":0},{"$f":"VLOOKUP(Q95,Flitch!$A$44:$F$54,6)","v":0},null,null,1,77.633598539175424,157.0117723264222]
[8,".9G+W",{"$f":"VLOOKUP((2+'Basic data'!M$5),'Basic data'!$G$7:$Y$14,7)","v":0.4},null,null,null,null,{"$f":"VLOOKUP('Basic data'!I$5,'Basic data'!$G$7:$Y$14,3)*'Basic data'!E$20*'Basic data'!F$20*'Basic data'!G$20","v":1.1135999999999999},null,null,null,null,null,null,{"$f":"('Input beam data'!$K$15)*(0.9*C96/VLOOKUP('Basic data'!V$5,'Basic data'!$G$7:$Y$14,16)-H96)","v":-1.4818011501047401},{"$f":"IF('Input beam data'!X$23=0,0.9*'Input beam data'!X$17+'Input beam data'!X$19,'Input beam data'!X$23)","v":0},{"$f":"MAX(ABS(O96*Span^2/8+P96*MIN('Input beam data'!X$16,(Span-'Input beam data'!X$16))/2),ABS(P96*'Input beam data'!X$16*(Span-'Input beam data'!X$16)/Span+O96*Span*MIN('Input beam data'!X$16,(Span-'Input beam data'!X$16))/2*(1-MIN('Input beam data'!X$16,(Span-'Input beam data'!X$16))/Span)))","v":1.6670262938678326},{"$f":"O96*'Input beam data'!$E$15/2+P96*MAX('Input beam data'!X$16,(Span-'Input beam data'!X$16))/Span","v":-2.2227017251571102},null,null,{"$f":"VLOOKUP((Q96/AJ96),VSGMSG8!$C$5:$H$11,6)","v":3},{"$f":"VLOOKUP((Q96/AJ96),VSGMSG8!$C$12:$H$17,6)","v":1},{"$f":"VLOOKUP((Q96/AJ96),VSGMSG8!$C$18:$H$23,6)","v":1},{"$f":"VLOOKUP((Q96/AJ96),VSGMSG8!$C$24:$H$29,6)","v":1},{"$f":"VLOOKUP((Q96/AJ96),LVL!B$5:F$14,4)","v":1},{"$f":"VLOOKUP((Q96/AJ96),LVL!B$15:F$26,4)","v":3},{"$f":"VLOOKUP((Q96/AJ96),LVL!B$27:F$33,4)","v":0},{"$f":"VLOOKUP((Q96/AJ96),Glulam!$A$5:$D$20,4)","v":0},{"$f":"VLOOKUP((Q96/AJ96),Glulam!$A$12:$D$20,4)","v":0},{"$f":"VLOOKUP(Q96,Steel!$C$4:$G$24,5)","v":1},{"$f":"VLOOKUP(Q96,Steel!$C$26:$G$35,5)","v":1},{"$f":"VLOOKUP(Q96,Flitch!$C$5:$F$10,4)","v":0},{"$f":"VLOOKUP(Q96,Flitch!$C$44:$F$54,4)","v":0},null,null,1,86.912400547809227,175.77788874837819,null,null,null,"bmnbmn"]
[9,"1.2G+yQ+S",{"$f":"VLOOKUP('Basic data'!M$5,'Basic data'!$G$7:$Y$14,7)","v":0.85},null,0,{"$f":"'Input beam data'!$O$9*VLOOKUP('Basic data'!$V$5,'Basic data'!$G$7:$Y$14,17)","v":0},null,null,null,null,null,null,null,null,{"$f":"('Input beam data'!$K$15)*(1.2*C97/VLOOKUP('Basic data'!V$5,'Basic data'!$G$7:$Y$14,16)+F97)","v":2.1119634080365692},{"$f":"IF('Input beam data'!X$23=0,1.2*'Input beam data'!X$17+0+1.2*'Input beam data'!X$21,'Input beam data'!X$23)","v":0},{"$f":"MAX(O97*Span^2/8+P97*MIN('Input beam data'!X$16,(Span-'Input beam data'!X$16))/2,P97*'Input beam data'!X$16*(Span-'Input beam data'!X$16)/Span+O97*Span*MIN('Input beam data'!X$16,(Span-'Input beam data'!X$16))/2*(1-MIN('Input beam data'!X$16,(Span-'Input beam data'!X$16))/Span))","v":2.3759588340411404},{"$f":"O97*'Input beam data'!$E$15/2+P97*MAX('Input beam data'!X$16,(Span-'Input beam data'!X$16))/Span","v":3.1679451120548539},null,null,{"$f":"VLOOKUP((Q97/AJ97),VSGMSG8!$B$5:$I$11,7)","v":3},{"$f":"VLOOKUP((Q97/AJ97),VSGMSG8!$B$12:$I$17,7)","v":2},{"$f":"VLOOKUP((Q97/AJ97),VSGMSG8!$B$18:$I$23,7)","v":1},{"$f":"VLOOKUP((Q97/AJ97),VSGMSG8!$B$24:$I$29,7)","v":1},{"$f":"VLOOKUP((Q97/AJ97),LVL!A$5:F$14,5)","v":2},{"$f":"VLOOKUP((Q97/AJ97),LVL!A$15:F$26,5)","v":3},{"$f":"VLOOKUP((Q97/AJ97),LVL!A$27:F$33,5)","v":0},{"$f":"VLOOKUP((Q97/AJ97),Glulam!$A$5:$D$20,4)","v":0},{"$f":"VLOOKUP((Q97/AJ97),Glulam!$A$12:$D$20,4)","v":0},{"$f":"VLOOKUP(Q97,Steel!$C$4:$G$24,5)","v":1},{"$f":"VLOOKUP(Q97,Steel!$C$26:$G$35,5)","v":1},{"$f":"VLOOKUP(Q97,Flitch!$A$5:$F$10,6)","v":0},{"$f":"VLOOKUP(Q97,Flitch!$A$44:$F$54,6)","v":0},null,null,0.8,27.078042983619866,54.764581315186241]
[null,null,null,null,null,null,null,null,null,null,null,null,null,null,null,null,"Min:",{"$f":"MIN(R89:R97)","v":-2.2227017251571102},null,"Max:",{"$f":"MAX(U89:U97)","v":5},3,3,3,4,4,1,2,1,1,1,{"$f":"MAX(AF89:AF97)","v":0},{"$f":"MAX(AG89:AG97)","v":0},null,null,null,{"$f":"MAX(AK89:AK97)","v":86.912400547809227},{"$f":"MAX(AL89:AL97)","v":175.77788874837819}]
["Application 8.  Garage door lintel",null,null,null,null,null,null,null,"(dry props)"]
[null,null,"Basic loads"]
[null,null,"Roof",null,null,null,null,null,"Upper wall","Lower wall","Floor/deck",null,null,null,"Actions",null,null,null,null,null,"Size index's",null,null,null,null,null,null,null,null,null,null,null,null,"Deflection limits",null,"Strength"]
["Load case",null,"G","Ql","Qs","S","W(e)","W(r)","G","G","G","Ql","Qs","S","UDL","P","M*","V*","EI(s)","EI(a)","MSG8",null,null,null,"LVL",null,null,"GL",null,"UB","MSC","Flitch",null,"(span/)","(mm)","dur. fact."]
[1,"G+Ql",{"$f":"VLOOKUP('Basic data'!M$5,'Basic data'!$G$7:$Y$14,7)","v":0.85},0,null,null,null,null,null,null,null,null,null,null,{"$f":"('Input beam data'!$K$15+'Input beam data'!$O$17)*(C103/VLOOKUP('Basic data'!V$5,'Basic data'!$G$7:$Y$14,16)+D103)","v":2.2879603587062833},{"$f":"IF('Input beam data'!X$23=0,'Input beam data'!X$17,'Input beam data'!X$23)","v":0},null,null,{"$f":"(0.013*O103*Span^3+0.0298*P103*Span^2*(3*MIN('Input beam data'!X$16,Span-'Input beam data'!X$16)/Span-4*(MIN('Input beam data'!X$16,Span-'Input beam data'!X$16)/Span)^3))*AH103","v":240.92222577177159},{"$f":"(0.013*O103*Span^4+0.0208*P103*Span^3*(3*MIN('Input beam data'!X$16,Span-'Input beam data'!X$16)/Span-4*(MIN('Input beam data'!X$16,Span-'Input beam data'!X$16)/Span)^3))/(AI103/1000)","v":24.092222577177161},{"$f":"VLOOKUP(MAX(S103:T103),VSGMSG8!G$5:I$11,2)","v":5},{"$f":"VLOOKUP(MAX(S103:T103),VSGMSG8!G$12:I$17,2)","v":4},{"$f":"VLOOKUP(MAX(S103:T103),VSGMSG8!G$18:I$23,2)","v":3},{"$f":"VLOOKUP(MAX(S103:T103),VSGMSG8!G$24:I$29,2)","v":3},{"$f":"VLOOKUP(MAX(S103:T103),LVL!D$5:F$14,2)","v":5},{"$f":"VLOOKUP(MAX(S103:T103),LVL!D$15:F$26,2)","v":4},{"$f":"VLOOKUP(MAX(S103:T103),LVL!D$27:F$33,2)","v":1},{"$f":"VLOOKUP(MAX(S103:T103),Glulam!C$5:E$11,2)","v":2},{"$f":"VLOOKUP(MAX(S103:T103),Glulam!C$12:E$20,2)","v":2},{"$f":"VLOOKUP(MAX(S103:T103),Steel!$F$4:$H$24,2)","v":1},{"$f":"VLOOKUP(MAX(S103:T103),Steel!$F$26:$H$35,2)","v":1},{"$f":"VLOOKUP(MAX(S103:T103),Flitch!$E$5:$F$10,2)","v":0},{"$f":"VLOOKUP(MAX(S103:T103),Flitch!E$44:F$54,2)","v":0},300,100]
[2,"G+Qs",{"$f":"VLOOKUP('Basic data'!M$5,'Basic data'!$G$7:$Y$14,7)","v":0.85},null,{"$f":"0.7*'Basic data'!$M$11","v":0.17499999999999999},null,null,null,null,null,null,null,null,null,{"$f":"('Input beam data'!$K$15+'Input beam data'!$O$17)*(C104/VLOOKUP('Basic data'!V$5,'Basic data'!$G$7:$Y$14,16)+E104)","v":2.7429603587062834},{"$f":"IF('Input beam data'!X$23=0,'Input beam data'!X$17+0.7*'Input beam data'!X$18,'Input beam data'!X$23)","v":0},null,null,{"$f":"(0.013*O104*Span^3+0.0298*P104*Span^2*(3*MIN('Input beam data'!X$16,Span-'Input beam data'!X$16)/Span-4*(MIN('Input beam data'!X$16,Span-'Input beam data'!X$16)/Span)^3))*AH104","v":288.83372577177158},{"$f":"(0.013*O104*Span^4+0.0208*P104*Span^3*(3*MIN('Input beam data'!X$16,Span-'Input beam data'!X$16)/Span-4*(MIN('Input beam data'!X$16,Span-'Input beam data'!X$16)/Span)^3))/(AI104/1000)","v":28.883372577177159},{"$f":"VLOOKUP(MAX(S104:T104),VSGMSG8!E$5:I$11,4)","v":5},{"$f":"VLOOKUP(MAX(S104:T104),VSGMSG8!E$12:I$17,4)","v":3},{"$f":"VLOOKUP(MAX(S104:T104),VSGMSG8!E$18:I$23,4)","v":2},{"$f":"VLOOKUP(MAX(S104:T104),VSGMSG8!E$24:I$29,4)","v":3},{"$f":"VLOOKUP(MAX(S104:T104),LVL!C$5:F$14,3)","v":4},{"$f":"VLOOKUP(MAX(S104:T104),LVL!C$15:F$26,3)","v":4},{"$f":"VLOOKUP(MAX(S104:T104),LVL!C$27:F$33,3)","v":1},{"$f":"VLOOKUP(MAX(S104:T104),Glulam!B$5:E$11,3)","v":2},{"$f":"VLOOKUP(MAX(S104:T104),Glulam!B$12:E$20,3)","v":1},{"$f":"VLOOKUP(MAX(S104:T104),Steel!$F$4:$H$24,2)","v":1},{"$f":"VLOOKUP(MAX(S104:T104),Steel!$F$26:$H$35,2)","v":1},{"$f":"VLOOKUP(MAX(S104:T104),Flitch!$D$5:$F$10,3)","v":0},{"$f":"VLOOKUP(MAX(S104:T104),Flitch!$D$44:$F$54,3)","v":0},300,100]
[3,"Spare"]
[4,"G+S",{"$f":"VLOOKUP('Basic data'!M$5,'Basic data'!$G$7:$Y$14,7)","v":0.85},null,0,{"$f":"0.68*'Input beam data'!$O$9*VLOOKUP('Basic data'!$V$5,'Basic data'!$G$7:$Y$14,17)","v":0},null,null,null,null,null,null,null,null,{"$f":"('Input beam data'!$K$15+'Input beam data'!$O$17)*(C106/VLOOKUP('Basic data'!V$5,'Basic data'!$G$7:$Y$14,16)+F106)","v":2.2879603587062833},{"$f":"IF('Input beam data'!X$23=0,'Input beam data'!X$17+'Input beam data'!X$21,'Input beam data'!X$23)","v":0},null,null,{"$f":"(0.013*O106*Span^3+0.0298*P106*Span^2*(3*MIN('Input beam data'!X$16,Span-'Input beam data'!X$16)/Span-4*(MIN('Input beam data'!X$16,Span-'Input beam data'!X$16)/Span)^3))*AH106","v":80.307408590590541},{"$f":"(0.013*O106*Span^4+0.0208*P106*Span^3*(3*MIN('Input beam data'!X$16,Span-'Input beam data'!X$16)/Span-4*(MIN('Input beam data'!X$16,Span-'Input beam data'!X$16)/Span)^3))/(AI106/1000)","v":96.368890308708643},{"$f":"VLOOKUP(MAX(S106:T106),VSGMSG8!E$5:I$11,4)","v":3},{"$f":"VLOOKUP(MAX(S106:T106),VSGMSG8!E$12:I$17,4)","v":2},{"$f":"VLOOKUP(MAX(S106:T106),VSGMSG8!E$18:I$23,4)","v":1},{"$f":"VLOOKUP(MAX(S106:T106),VSGMSG8!E$24:I$29,4)","v":1},{"$f":"VLOOKUP(MAX(S106:T106),LVL!C$5:F$14,3)","v":2},{"$f":"VLOOKUP(MAX(S106:T106),LVL!C$15:F$26,3)","v":3},{"$f":"VLOOKUP(MAX(S106:T106),LVL!C$27:F$33,3)","v":0},{"$f":"VLOOKUP(MAX(S106:T106),Glulam!B$5:E$11,3)","v":0},{"$f":"VLOOKUP(MAX(S106:T106),Glulam!B$12:E$20,3)","v":0},{"$f":"VLOOKUP(MAX(S106:T106),Steel!$F$4:$H$24,2)","v":1},{"$f":"VLOOKUP(MAX(S106:T106),Steel!$F$26:$H$35,2)","v":1},{"$f":"VLOOKUP(MAX(S106:T106),Flitch!$D$5:$F$10,3)","v":0},{"$f":"VLOOKUP(MAX(S106:T106),Flitch!$D$44:$F$54,3)","v":0},100,25]
[5,"1.35G",{"$f":"VLOOKUP('Basic data'!M$5,'Basic data'!$G$7:$Y$14,7)","v":0.85},null,null,null,null,null,null,null,null,null,null,null,{"$f":"('Input beam data'!$K$15+'Input beam data'!$O$17)*(1.35*C107/VLOOKUP('Basic data'!V$5,'Basic data'!$G$7:$Y$14,16))","v":3.0887464842534826},{"$f":"IF('Input beam data'!X$23=0,1.35*'Input beam data'!X$17,'Input beam data'!X$23)","v":0},{"$f":"MAX(O107*Span^2/8+P107*MIN('Input beam data'!X$16,(Span-'Input beam data'!X$16))/2,P107*'Input beam data'!X$16*(Span-'Input beam data'!X$16)/Span+O107*Span*MIN('Input beam data'!X$16,(Span-'Input beam data'!X$16))/2*(1-MIN('Input beam data'!X$16,(Span-'Input beam data'!X$16))/Span))","v":3.4748397947851681},{"$f":"O107*'Input beam data'!$E$15/2+P107*MAX('Input beam data'!X$16,(Span-'Input beam data'!X$16))/Span","v":4.6331197263802242},null,null,{"$f":"VLOOKUP((Q107/AJ107),VSGMSG8!$B$5:$I$11,7)","v":5},{"$f":"VLOOKUP((Q107/AJ107),VSGMSG8!$B$12:$I$17,7)","v":3},{"$f":"VLOOKUP((Q107/AJ107),VSGMSG8!$B$18:$I$23,7)","v":2},{"$f":"VLOOKUP((Q107/AJ107),VSGMSG8!$B$24:$I$29,7)","v":2},{"$f":"VLOOKUP((Q107/AJ107),LVL!A$5:F$14,5)","v":4},{"$f":"VLOOKUP((Q107/AJ107),LVL!A$15:F$26,5)","v":3},{"$f":"VLOOKUP((Q107/AJ107),LVL!A$27:F$33,5)","v":0},{"$f":"VLOOKUP((Q107/AJ107),Glulam!$A$5:$D$20,4)","v":1},{"$f":"VLOOKUP((Q107/AJ107),Glulam!$A$12:$D$20,4)","v":1},{"$f":"VLOOKUP(Q107,Steel!$E$64:$G$84,3)","v":1},{"$f":"VLOOKUP(Q107,Steel!$E$26:$G$35,3)","v":1},{"$f":"VLOOKUP(Q107,Flitch!$B$5:$F$10,5)","v":0},{"$f":"VLOOKUP(Q107,Flitch!$B$44:$F$54,5)","v":0},null,null,0.6,53.309897124001616,107.81776946427293]
[6,"1.2G+1.5Q",{"$f":"VLOOKUP('Basic data'!M$5,'Basic data'!$G$7:$Y$14,7)","v":0.85},null,{"$f":"'Basic data'!M$11","v":0.25},null,null,null,null,null,null,null,null,null,{"$f":"('Input beam data'!$K$15+'Input beam data'!$O$17)*(1.2*C108/VLOOKUP('Basic data'!V$5,'Basic data'!$G$7:$Y$14,16)+1.5*E108)","v":3.7205524304475399},{"$f":"IF('Input beam data'!X$23=0,1.2*'Input beam data'!X$17+1.5*'Input beam data'!X$18,'Input beam data'!X$23)","v":0},{"$f":"MAX(O108*Span^2/8+P108*MIN('Input beam data'!X$16,(Span-'Input beam data'!X$16))/2,P108*'Input beam data'!X$16*(Span-'Input beam data'!X$16)/Span+O108*Span*MIN('Input beam data'!X$16,(Span-'Input beam data'!X$16))/2*(1-MIN('Input beam data'!X$16,(Span-'Input beam data'!X$16))/Span))","v":4.185621484253482},{"$f":"O108*'Input beam data'!$E$15/2+P108*MAX('Input beam data'!X$16,(Span-'Input beam data'!X$16))/Span","v":5.5808286456713097},null,null,{"$f":"VLOOKUP((Q108/AJ108),VSGMSG8!$B$5:$I$11,7)","v":5},{"$f":"VLOOKUP((Q108/AJ108),VSGMSG8!$B$12:$I$17,7)","v":3},{"$f":"VLOOKUP((Q108/AJ108),VSGMSG8!$B$18:$I$23,7)","v":2},{"$f":"VLOOKUP((Q108/AJ108),VSGMSG8!$B$24:$I$29,7)","v":2},{"$f":"VLOOKUP((Q108/AJ108),LVL!A$5:F$14,5)","v":4},{"$f":"VLOOKUP((Q108/AJ108),LVL!A$15:F$26,5)","v":3},{"$f":"VLOOKUP((Q108/AJ108),LVL!A$27:F$33,5)","v":0},{"$f":"VLOOKUP((Q108/AJ108),Glulam!$A$5:$D$20,4)","v":1},{"$f":"VLOOKUP((Q108/AJ108),Glulam!$A$12:$D$20,4)","v":1},{"$f":"VLOOKUP(Q108,Steel!$E$64:$G$84,3)","v":1},{"$f":"VLOOKUP(Q108,Steel!$E$26:$G$35,3)","v":1},{"$f":"VLOOKUP(Q108,Flitch!$A$5:$F$10,6)","v":0},{"$f":"VLOOKUP(Q108,Flitch!$A$44:$F$54,6)","v":0},null,null,0.8,83.844908554668109,169.57397235775571]
[7,"1.2G+yQ+W",{"$f":"VLOOKUP('Basic data'!M$5,'Basic data'!$G$7:$Y$14,7)","v":0.85},null,0,null,{"$f":"VLOOKUP('Basic data'!I$5,'Basic data'!$G$7:$Y$14,3)*'Basic data'!D$19*'Basic data'!F$19*'Basic data'!G$19","v":0.23199999999999998},{"$f":"VLOOKUP('Basic data'!I$5,'Basic data'!$G$7:$Y$14,3)*'Basic data'!E$19*'Basic data'!F$19*'Basic data'!G$19","v":0.57999999999999996},null,null,null,null,null,null,{"$f":"('Input beam data'!$K$15+'Input beam data'!$O$17)*(1.2*C109/VLOOKUP('Basic data'!V$5,'Basic data'!$G$7:$Y$14,16)+H109)","v":4.2535524304475407},{"$f":"IF('Input beam data'!X$23=0,1.2*'Input beam data'!X$17+0+'Input beam data'!X$20,'Input beam data'!X$23)","v":0},{"$f":"MAX(O109*Span^2/8+P109*MIN('Input beam data'!X$16,(Span-'Input beam data'!X$16))/2,P109*'Input beam data'!X$16*(Span-'Input beam data'!X$16)/Span+O109*Span*MIN('Input beam data'!X$16,(Span-'Input beam data'!X$16))/2*(1-MIN('Input beam data'!X$16,(Span-'Input beam data'!X$16))/Span))","v":4.7852464842534834},{"$f":"O109*'Input beam data'!$E$15/2+P109*MAX('Input beam data'!X$16,(Span-'Input beam data'!X$16))/Span","v":6.3803286456713106},null,null,{"$f":"VLOOKUP((Q109/AJ109),VSGMSG8!$B$5:$I$11,7)","v":4},{"$f":"VLOOKUP((Q109/AJ109),VSGMSG8!$B$12:$I$17,7)","v":3},{"$f":"VLOOKUP((Q109/AJ109),VSGMSG8!$B$18:$I$23,7)","v":2},{"$f":"VLOOKUP((Q109/AJ109),VSGMSG8!$B$24:$I$29,7)","v":2},{"$f":"VLOOKUP((Q109/AJ109),LVL!A$5:F$14,5)","v":4},{"$f":"VLOOKUP((Q109/AJ109),LVL!A$15:F$26,5)","v":3},{"$f":"VLOOKUP((Q109/AJ109),LVL!A$27:F$33,5)","v":0},{"$f":"VLOOKUP((Q109/AJ109),Glulam!$A$5:$D$20,4)","v":1},{"$f":"VLOOKUP((Q109/AJ109),Glulam!$A$12:$D$20,4)","v":1},{"$f":"VLOOKUP(Q109,Steel!$E$64:$G$84,3)","v":1},{"$f":"VLOOKUP(Q109,Steel!$E$26:$G$35,3)","v":1},{"$f":"VLOOKUP(Q109,Flitch!$A$5:$F$10,6)","v":0},{"$f":"VLOOKUP(Q109,Flitch!$A$44:$F$54,6)","v":0},null,null,1,135.85879744355697,274.77060157123879]
[8,".9G+W",{"$f":"VLOOKUP((5+'Basic data'!M$5),'Basic data'!$G$7:$Y$14,7)","v":0.4},null,null,null,{"$f":"VLOOKUP('Basic data'!I$5,'Basic data'!$G$7:$Y$14,3)*'Basic data'!D$20*'Basic data'!F$20*'Basic data'!G$20","v":1.8559999999999999},{"$f":"VLOOKUP('Basic data'!I$5,'Basic data'!$G$7:$Y$14,3)*'Basic data'!E$20*'Basic data'!F$20*'Basic data'!G$20","v":1.1135999999999999},null,null,null,null,null,null,{"$f":"LD*(0.9*C110/VLOOKUP('Basic data'!V$5,'Basic data'!$G$7:$Y$14,16)-H110)+Overhang*(0.9*C110/VLOOKUP('Basic data'!V$5,'Basic data'!$G$7:$Y$14,16)-G110)*((LD+Overhang/2)/LD)","v":-2.5052785468908754},{"$f":"IF('Input beam data'!X$23=0,0.9*'Input beam data'!X$17+'Input beam data'!X$19,'Input beam data'!X$23)","v":0},{"$f":"MAX(ABS(O110*Span^2/8+P110*MIN('Input beam data'!X$16,(Span-'Input beam data'!X$16))/2),ABS(P110*'Input beam data'!X$16*(Span-'Input beam data'!X$16)/Span+O110*Span*MIN('Input beam data'!X$16,(Span-'Input beam data'!X$16))/2*(1-MIN('Input beam data'!X$16,(Span-'Input beam data'!X$16))/Span)))","v":2.8184383652522347},{"$f":"O110*'Input beam data'!$E$15/2+P110*MAX('Input beam data'!X$16,(Span-'Input beam data'!X$16))/Span","v":-3.7579178203363131},null,null,{"$f":"VLOOKUP((Q110/AJ110),VSGMSG8!$C$5:$H$11,6)","v":3},{"$f":"VLOOKUP((Q110/AJ110),VSGMSG8!$C$12:$H$17,6)","v":2},{"$f":"VLOOKUP((Q110/AJ110),VSGMSG8!$C$18:$H$23,6)","v":1},{"$f":"VLOOKUP((Q110/AJ110),VSGMSG8!$C$24:$H$29,6)","v":1},{"$f":"VLOOKUP((Q110/AJ110),LVL!B$5:F$14,4)","v":2},{"$f":"VLOOKUP((Q110/AJ110),LVL!B$15:F$26,4)","v":3},{"$f":"VLOOKUP((Q110/AJ110),LVL!B$27:F$33,4)","v":0},{"$f":"VLOOKUP((Q110/AJ110),Glulam!$A$5:$D$20,4)","v":0},{"$f":"VLOOKUP((Q110/AJ110),Glulam!$A$12:$D$20,4)","v":0},{"$f":"VLOOKUP(Q110,Steel!$D$39:$G$59,4)","v":1},{"$f":"VLOOKUP(Q110,Steel!$D$26:$G$35,4)","v":1},{"$f":"VLOOKUP(Q110,Flitch!$C$5:$F$10,4)","v":0},{"$f":"VLOOKUP(Q110,Flitch!$C$44:$F$54,4)","v":0},null,null,1,253.58707347303542,512.87273286681318]
[9,"1.2G+yQ+S",{"$f":"VLOOKUP('Basic data'!M$5,'Basic data'!$G$7:$Y$14,7)","v":0.85},null,0,{"$f":"'Input beam data'!$O$9*VLOOKUP('Basic data'!$V$5,'Basic data'!$G$7:$Y$14,17)","v":0},null,null,null,null,null,null,null,null,{"$f":"('Input beam data'!$K$15+'Input beam data'!$O$17)*(1.2*C111/VLOOKUP('Basic data'!V$5,'Basic data'!$G$7:$Y$14,16)+F111)","v":2.7455524304475403},{"$f":"IF('Input beam data'!X$23=0,1.2*'Input beam data'!X$17+0+1.2*'Input beam data'!X$21,'Input beam data'!X$23)","v":0},{"$f":"MAX(O111*Span^2/8+P111*MIN('Input beam data'!X$16,(Span-'Input beam data'!X$16))/2,P111*'Input beam data'!X$16*(Span-'Input beam data'!X$16)/Span+O111*Span*MIN('Input beam data'!X$16,(Span-'Input beam data'!X$16))/2*(1-MIN('Input beam data'!X$16,(Span-'Input beam data'!X$16))/Span))","v":3.0887464842534826},{"$f":"O111*'Input beam data'!$E$15/2+P111*MAX('Input beam data'!X$16,(Span-'Input beam data'!X$16))/Span","v":4.1183286456713102},null,null,{"$f":"VLOOKUP((Q111/AJ111),VSGMSG8!$B$5:$I$11,7)","v":4},{"$f":"VLOOKUP((Q111/AJ111),VSGMSG8!$B$12:$I$17,7)","v":2},{"$f":"VLOOKUP((Q111/AJ111),VSGMSG8!$B$18:$I$23,7)","v":2},{"$f":"VLOOKUP((Q111/AJ111),VSGMSG8!$B$24:$I$29,7)","v":2},{"$f":"VLOOKUP((Q111/AJ111),LVL!A$5:F$14,5)","v":3},{"$f":"VLOOKUP((Q111/AJ111),LVL!A$15:F$26,5)","v":3},{"$f":"VLOOKUP((Q111/AJ111),LVL!A$27:F$33,5)","v":0},{"$f":"VLOOKUP((Q111/AJ111),Glulam!$A$5:$D$20,4)","v":1},{"$f":"VLOOKUP((Q111/AJ111),Glulam!$A$12:$D$20,4)","v":1},{"$f":"VLOOKUP(Q111,Steel!$E$64:$G$84,3)","v":1},{"$f":"VLOOKUP(Q111,Steel!$E$26:$G$35,3)","v":1},{"$f":"VLOOKUP(Q111,Flitch!$A$5:$F$10,6)","v":0},{"$f":"VLOOKUP(Q111,Flitch!$A$44:$F$54,6)","v":0},null,null,0.8,47.386575221334766,95.838017301575931]
[null,null,null,null,null,null,null,null,null,null,null,null,null,null,null,null,"Min:",{"$f":"MIN(R103:R111)","v":-3.7579178203363131},null,"Max:",{"$f":"MAX(U103:U111)","v":5},4,3,3,5,4,1,2,2,1,1,{"$f":"MAX(AF103:AF111)","v":0},{"$f":"MAX(AG103:AG111)","v":0},null,null,null,{"$f":"MAX(AK103:AK111)","v":253.58707347303542},{"$f":"MAX(AL103:AL111)","v":512.87273286681318}]
["Application 9.  Cantilever lintels",null,null,null,null,null,"(dry props)",null,null,null,null,null,null,null,"Configuration",3]
[null,null,"Basic loads",null,null,"(kPa)",null,null,"Loads on plan",null,null,null,null,null,"Cantilever lintel (1)",null,null,null,null,null,null,null,null,null,null,null,null,null,null,null,null,null,null,null,null,null,null,null,"Supported lintel",null,null,null,"Cantilever lintel 2"]
[null,null,"Roof",null,null,null,null,null,"(kPa)",null,null,null,null,null,"Actions",null,null,null,null,null,"Size index's",null,null,null,null,null,null,null,null,null,null,null,null,"Deflection limits",null,"Strength",null,null,"Actions",null,null,null,"Actions"]
["Load case",null,"G","Ql","Qs","S","W(e)","W(r)","G","Totals",null,null,null,null,"Dist load","P","M*","V*","EI(s)","EI(a)","MSG8",null,null,null,"LVL",null,null,"GL",null,"UB","MSC","Flitch",null,"(span/)","(mm)","dur. fact.",null,null,"Dist load","M*","EI(s)","EI(a)","Dist load","P","M*","V*","EI(s)","EI(a)"]
[1,"G+Ql",{"$f":"VLOOKUP('Basic data'!M$5,'Basic data'!$G$7:$Y$14,7)","v":0.85},0,null,null,null,null,{"$f":"C117/VLOOKUP('Basic data'!V$5,'Basic data'!$G$7:$Y$14,16)","v":0.87998475334857051},{"$f":"SUM(D117:I117)","v":0.87998475334857051},null,null,null,null,{"$f":"IF(OR($P$113=1,$P$113=2),J117*Span^2/4+J117*Overhang*Span,IF(P113=3,J117*(LD+Overhang)*Span,0.5*Span))","v":6.86388107611885},{"$f":"IF($P$113=1,AM117/3+O117*LD^2/6,IF($P$113=2,O117*LD^2/6*(Span_2^3)/(Span^3+Span_2^3),AM117/2))","v":0},{"$f":"IF(OR(P$113=1,P$113=2),0.333*O117*Span+P117*Span,0.5*O117*Span+P117*Span)","v":10.295821614178275},null,null,{"$f":"1/(AI117/1000)*IF(OR(P113=1,P113=2),(O117*Span^3/15+P117*Span^3/3+Q117*Span*BSpan/3),O117*Span^3/8+P117*Span^3/3+Q117*Span*BSpan/3)","v":1930.4665526584265},{"$f":"VLOOKUP(MAX(S117:T117),VSGMSG8!G$5:I$11,2)","v":6},{"$f":"VLOOKUP(MAX(S117:T117),VSGMSG8!G$12:I$17,2)","v":5},{"$f":"VLOOKUP(MAX(S117:T117),VSGMSG8!G$18:I$23,2)","v":5},{"$f":"VLOOKUP(MAX(S117:T117),VSGMSG8!G$24:I$29,2)","v":5},{"$f":"VLOOKUP(MAX(S117:T117),LVL!D$5:F$14,2)","v":9},{"$f":"VLOOKUP(MAX(S117:T117),LVL!D$15:F$26,2)","v":8},{"$f":"VLOOKUP(MAX(S117:T117),LVL!D$27:F$33,2)","v":4},{"$f":"VLOOKUP(MAX(S117:T117),Glulam!C$5:E$11,2)","v":6},{"$f":"VLOOKUP(MAX(S117:T117),Glulam!C$12:E$20,2)","v":6},{"$f":"VLOOKUP(MAX(S117:T117),Steel!$F$4:$H$24,2)","v":3},{"$f":"VLOOKUP(MAX(S117:T117),Steel!$F$26:$H$35,2)","v":4},{"$f":"VLOOKUP(MAX(S117:T117),Flitch!$E$5:$F$10,2)","v":3},{"$f":"VLOOKUP(MAX(S117:T117),Flitch!E$44:F$54,2)","v":5},300,12,null,null,null,{"$f":"IF($P$113=1,J117*Span_2^2/4+J117*Overhang*Span_2,IF($P$113=2,0,IF($P$113=3,0.5*Span_2,J117*(LDcant+Overhang)*Span_2)))","v":0},null,null,null,{"$f":"IF($P$113=2,J117*Span_2^2/4+J117*Overhang*Span_2,0)","v":0},{"$f":"IF($P$113=2,O117*LD^2/6*(Span^3)/(Span^3+Span_2^3),0)","v":0},null,null,null,{"$f":"1/(AI117/1000)*(O117*Span^3/15+P117*Span^3/3+Q117*Span*BSpan/3)","v":1029.5821614178276}]
[2,"G+Qs",{"$f":"VLOOKUP('Basic data'!M$5,'Basic data'!$G$7:$Y$14,7)","v":0.85},null,{"$f":"0.7*'Basic data'!$M$11","v":0.17499999999999999},null,null,null,{"$f":"C118/VLOOKUP('Basic data'!V$5,'Basic data'!$G$7:$Y$14,16)","v":0.87998475334857051},{"$f":"SUM(D118:I118)","v":1.0549847533485706},null,null,null,null,{"$f":"IF(OR($P$113=1,$P$113=2),J118*Span^2/4+J118*Overhang*Span,IF(P113=3,J118*(LD+Overhang)*Span,0.5*Span))","v":8.2288810761188493},{"$f":"IF($P$113=1,AM118/3+O118*LD^2/6,IF($P$113=2,O118*LD^2/6*(Span_2^3)/(Span^3+Span_2^3),AM118/2))","v":0},{"$f":"IF(OR(P$113=1,P$113=2),0.333*O118*Span+P118*Span,0.5*O118*Span+P118*Span)","v":12.343321614178274},null,null,{"$f":"1/(AI118/1000)*IF(OR(P113=1,P113=2),(O118*Span^3/15+P118*Span^3/3+Q118*Span*BSpan/3),O118*Span^3/8+P118*Span^3/3+Q118*Span*BSpan/3)","v":2314.3728026584263},{"$f":"VLOOKUP(MAX(S118:T118),VSGMSG8!E$5:I$11,4)","v":6},{"$f":"VLOOKUP(MAX(S118:T118),VSGMSG8!E$12:I$17,4)","v":5},{"$f":"VLOOKUP(MAX(S118:T118),VSGMSG8!E$18:I$23,4)","v":5},{"$f":"VLOOKUP(MAX(S118:T118),VSGMSG8!E$24:I$29,4)","v":5},{"$f":"VLOOKUP(MAX(S118:T118),LVL!C$5:F$14,3)","v":8},{"$f":"VLOOKUP(MAX(S118:T118),LVL!C$15:F$26,3)","v":7},{"$f":"VLOOKUP(MAX(S118:T118),LVL!C$27:F$33,3)","v":4},{"$f":"VLOOKUP(MAX(S118:T118),Glulam!B$5:E$11,3)","v":6},{"$f":"VLOOKUP(MAX(S118:T118),Glulam!B$12:E$20,3)","v":5},{"$f":"VLOOKUP(MAX(S118:T118),Steel!$F$4:$H$24,2)","v":4},{"$f":"VLOOKUP(MAX(S118:T118),Steel!$F$26:$H$35,2)","v":4},{"$f":"VLOOKUP(MAX(S118:T118),Flitch!$D$5:$F$10,3)","v":4},{"$f":"VLOOKUP(MAX(S118:T118),Flitch!$D$44:$F$54,3)","v":6},300,12,null,null,null,{"$f":"IF($P$113=1,J118*Span_2^2/4+J118*Overhang*Span_2,IF($P$113=2,0,IF($P$113=3,0.5*Span_2,J118*(LDcant+Overhang)*Span_2)))","v":0},null,null,null,{"$f":"IF($P$113=2,J118*Span_2^2/4+J118*Overhang*Span_2,0)","v":0},{"$f":"IF($P$113=2,O118*LD^2/6*(Span^3)/(Span^3+Span_2^3),0)","v":0},null,null,null,{"$f":"1/(AI118/1000)*(O118*Span^3/15+P118*Span^3/3+Q118*Span*BSpan/3)","v":1234.3321614178274}]
[3,"Spare"]
[4,"G+S",{"$f":"VLOOKUP('Basic data'!M$5,'Basic data'!$G$7:$Y$14,7)","v":0.85},null,0,{"$f":"0.68*'Input beam data'!$O$9*VLOOKUP('Basic data'!$V$5,'Basic data'!$G$7:$Y$14,17)","v":0},null,null,{"$f":"C120/VLOOKUP('Basic data'!V$5,'Basic data'!$G$7:$Y$14,16)","v":0.87998475334857051},{"$f":"SUM(D120:I120)","v":0.87998475334857051},null,null,null,null,{"$f":"IF(OR($P$113=1,$P$113=2),J120*Span^2/4+J120*Overhang*Span,IF(P113=3,J120*(LD+Overhang)*Span,0.5*Span))","v":6.86388107611885},{"$f":"IF($P$113=1,AM120/3+O120*LD^2/6,IF($P$113=2,O120*LD^2/6*(Span_2^3)/(Span^3+Span_2^3),AM120/2))","v":0},{"$f":"IF(OR(P$113=1,P$113=2),0.333*O120*Span+P120*Span,0.5*O120*Span+P120*Span)","v":10.295821614178275},null,"R*",{"$f":"1/(AI120/1000)*IF(OR(P113=1,P113=2),(O120*Span^3/15+P120*Span^3/3+Q120*Span*BSpan/3),O120*Span^3/8+P120*Span^3/3+Q120*Span*BSpan/3)","v":1930.4665526584265},{"$f":"VLOOKUP(MAX(S120:T120),VSGMSG8!E$5:I$11,4)","v":6},{"$f":"VLOOKUP(MAX(S120:T120),VSGMSG8!E$12:I$17,4)","v":5},{"$f":"VLOOKUP(MAX(S120:T120),VSGMSG8!E$18:I$23,4)","v":5},{"$f":"VLOOKUP(MAX(S120:T120),VSGMSG8!E$24:I$29,4)","v":5},{"$f":"VLOOKUP(MAX(S120:T120),LVL!C$5:F$14,3)","v":8},{"$f":"VLOOKUP(MAX(S120:T120),LVL!C$15:F$26,3)","v":7},{"$f":"VLOOKUP(MAX(S120:T120),LVL!C$27:F$33,3)","v":4},{"$f":"VLOOKUP(MAX(S120:T120),Glulam!B$5:E$11,3)","v":5},{"$f":"VLOOKUP(MAX(S120:T120),Glulam!B$12:E$20,3)","v":5},{"$f":"VLOOKUP(MAX(S120:T120),Steel!$F$4:$H$24,2)","v":3},{"$f":"VLOOKUP(MAX(S120:T120),Steel!$F$26:$H$35,2)","v":4},{"$f":"VLOOKUP(MAX(S120:T120),Flitch!$D$5:$F$10,3)","v":3},{"$f":"VLOOKUP(MAX(S120:T120),Flitch!$D$44:$F$54,3)","v":5},100,12,null,null,null,{"$f":"IF($P$113=1,J120*Span_2^2/4+J120*Overhang*Span_2,IF($P$113=2,0,IF($P$113=3,0.5*Span_2,J120*(LDcant+Overhang)*Span_2)))","v":0},null,null,null,{"$f":"IF($P$113=2,J120*Span_2^2/4+J120*Overhang*Span_2,0)","v":0},{"$f":"IF($P$113=2,O120*LD^2/6*(Span^3)/(Span^3+Span_2^3),0)","v":0},null,null,null,{"$f":"1/(AI120/1000)*(O120*Span^3/15+P120*Span^3/3+Q120*Span*BSpan/3)","v":1029.5821614178276}]
[5,"1.35G",{"$f":"VLOOKUP('Basic data'!M$5,'Basic data'!$G$7:$Y$14,7)","v":0.85},null,null,null,null,null,{"$f":"C121/VLOOKUP('Basic data'!V$5,'Basic data'!$G$7:$Y$14,16)","v":0.87998475334857051},{"$f":"1.35*I121","v":1.1879794170205702},null,null,null,null,{"$f":"IF(OR($P$113=1,$P$113=2),J121*Span^2/4+J121*Overhang*Span,IF(P113=3,J121*(LD+Overhang)*Span,1.35*0.5*Span))","v":9.2662394527604484},{"$f":"IF($P$113=1,AM121/3+O121*LD^2/6,IF($P$113=2,O121*LD^2/6*(Span_2^3)/(Span^3+Span_2^3),AM121/2))","v":0},{"$f":"IF(OR(P$113=1,P$113=2),0.333*O121*Span+P121*Span,0.5*O121*Span+P121*Span)","v":13.899359179140673},{"$f":"O121+P121","v":9.2662394527604484},{"$f":"R121+Q121/BSpan","v":{"$error":"#DIV/0!"}},null,{"$f":"VLOOKUP((MAX(Q121,AN121,AS121)/AJ121),VSGMSG8!$B$5:$I$11,7)","v":6},{"$f":"VLOOKUP(MAX(Q121,AN121,AS121)/AJ121,VSGMSG8!$B$12:$I$17,7)","v":5},{"$f":"VLOOKUP(MAX(Q121,AN121,AS121)/AJ121,VSGMSG8!$B$18:$I$23,7)","v":5},{"$f":"VLOOKUP(MAX(Q121,AN121,AS121)/AJ121,VSGMSG8!$B$24:$I$29,7)","v":5},{"$f":"VLOOKUP(MAX(Q121,AN121,AS121)/AJ121,LVL!A$5:F$14,5)","v":7},{"$f":"VLOOKUP(MAX(Q121,AN121,AS121)/AJ121,LVL!A$15:F$26,5)","v":6},{"$f":"VLOOKUP(MAX(Q121,AN121,AS121)/AJ121,LVL!A$27:F$33,5)","v":3},{"$f":"VLOOKUP(MAX(Q121,AN121,AS121)/AJ121,Glulam!$A$5:$D$20,4)","v":5},{"$f":"VLOOKUP(MAX(Q121,AN121,AS121)/AJ121,Glulam!$A$12:$D$20,4)","v":5},{"$f":"VLOOKUP(MAX(Q121,AN121,AS121),Steel!$E$64:$G$84,3)","v":2},{"$f":"VLOOKUP(MAX(Q121,AN121,AS121),Steel!$E$26:$G$35,3)","v":3},{"$f":"VLOOKUP(MAX(Q121,AN121,AS121),Flitch!$B$5:$F$10,5)","v":3},{"$f":"VLOOKUP(MAX(Q121,AN121,AS121),Flitch!$B$44:$F$54,5)","v":2},null,null,0.6,null,null,{"$f":"IF($P$113=1,J121*Span_2^2/4+J121*Overhang*Span_2,IF($P$113=2,0,IF($P$113=3,0.5*Span_2,J121*(LDcant+Overhang)*Span_2)))","v":0},{"$f":"IF(P$113=1,0.128*AM121*Span_2,IF(P$113=2,0,AM121*Span_2/8))","v":0},null,null,{"$f":"IF($P$113=2,J121*Span_2^2/4+J121*Overhang*Span_2,0)","v":0},{"$f":"IF($P$113=2,O121*LD^2/6*(Span^3)/(Span^3+Span_2^3),0)","v":0},{"$f":"IF(P$113=2,0.333*AQ121*Span_2+AR121*Span_2,0)","v":0},{"$f":"AQ121+AR121","v":0}]
[6,"1.2G+1.5Q",{"$f":"VLOOKUP('Basic data'!M$5,'Basic data'!$G$7:$Y$14,7)","v":0.85},null,{"$f":"'Basic data'!M$11","v":0.25},null,null,null,{"$f":"C122/VLOOKUP('Basic data'!V$5,'Basic data'!$G$7:$Y$14,16)","v":0.87998475334857051},{"$f":"1.2*I122+1.5*E122","v":1.4309817040182846},null,null,null,null,{"$f":"IF(OR($P$113=1,$P$113=2),J122*Span^2/4+J122*Overhang*Span,IF(P113=3,J122*(LD+Overhang)*Span,1.2*0.5*Span))","v":11.161657291342619},0,{"$f":"IF(OR(P$113=1,P$113=2),0.333*O122*Span+P122*Span,0.5*O122*Span+P122*Span)","v":16.742485937013928},{"$f":"O122+P122","v":11.161657291342619},{"$f":"R122+Q122/BSpan","v":{"$error":"#DIV/0!"}},null,{"$f":"VLOOKUP(MAX(Q122,AN122,AS122)/AJ122,VSGMSG8!$B$5:$I$11,7)","v":6},{"$f":"VLOOKUP(MAX(Q122,AN122,AS122)/AJ122,VSGMSG8!$B$12:$I$17,7)","v":5},{"$f":"VLOOKUP(MAX(Q122,AN122,AS122)/AJ122,VSGMSG8!$B$18:$I$23,7)","v":5},{"$f":"VLOOKUP(MAX(Q122,AN122,AS122)/AJ122,VSGMSG8!$B$24:$I$29,7)","v":5},{"$f":"VLOOKUP(MAX(Q122,AN122,AS122)/AJ122,LVL!A$5:F$14,5)","v":7},{"$f":"VLOOKUP(MAX(Q122,AN122,AS122)/AJ122,LVL!A$15:F$26,5)","v":6},{"$f":"VLOOKUP(MAX(Q122,AN122,AS122)/AJ122,LVL!A$27:F$33,5)","v":2},{"$f":"VLOOKUP(MAX(Q122,AN122,AS122)/AJ122,Glulam!$A$5:$D$20,4)","v":5},{"$f":"VLOOKUP(MAX(Q122,AN122,AS122)/AJ122,Glulam!$A$12:$D$20,4)","v":5},{"$f":"VLOOKUP(MAX(Q122,AN122,AS122),Steel!$E$64:$G$84,3)","v":2},{"$f":"VLOOKUP(MAX(Q122,AN122,AS122),Steel!$E$26:$G$35,3)","v":3},{"$f":"VLOOKUP(MAX(Q122,AN122,AS122),Flitch!$B$5:$F$10,5)","v":3},{"$f":"VLOOKUP(MAX(Q122,AN122,AS122),Flitch!$B$44:$F$54,5)","v":3},null,null,0.8,null,null,{"$f":"IF($P$113=1,J122*Span_2^2/4+J122*Overhang*Span_2,IF($P$113=2,0,IF($P$113=3,0.5*Span_2,J122*(LDcant+Overhang)*Span_2)))","v":0},{"$f":"IF(P$113=1,0.128*AM122*Span_2,IF(P$113=2,0,AM122*Span_2/8))","v":0},null,null,{"$f":"IF($P$113=2,J122*Span_2^2/4+J122*Overhang*Span_2,0)","v":0},0,{"$f":"IF(P$113=2,0.333*AQ122*Span_2+AR122*Span_2,0)","v":0},{"$f":"AQ122+AR122","v":0}]
[7,"1.2G+yQ+W",{"$f":"VLOOKUP('Basic data'!M$5,'Basic data'!$G$7:$Y$14,7)","v":0.85},null,0,null,{"$f":"VLOOKUP('Basic data'!I$5,'Basic data'!$G$7:$Y$14,3)*'Basic data'!D$19*'Basic data'!F$19*'Basic data'!G$19","v":0.23199999999999998},{"$f":"VLOOKUP('Basic data'!I$5,'Basic data'!$G$7:$Y$14,3)*'Basic data'!E$19*'Basic data'!F$19*'Basic data'!G$19","v":0.57999999999999996},{"$f":"C123/VLOOKUP('Basic data'!V$5,'Basic data'!$G$7:$Y$14,16)","v":0.87998475334857051},{"$f":"1.2*I123+H123","v":1.6359817040182847},null,null,null,null,{"$f":"IF(OR($P$113=1,$P$113=2),J123*Span^2/4+(1.2*I123+G123)*Overhang*Span,IF(P113=3,J123*(LD+Overhang)*Span,1.2*0.5*Span))","v":12.760657291342621},0,{"$f":"IF(OR(P$113=1,P$113=2),0.333*O123*Span+P123*Span,0.5*O123*Span+P123*Span)","v":19.14098593701393},{"$f":"O123+P123","v":12.760657291342621},{"$f":"R123+Q123/BSpan","v":{"$error":"#DIV/0!"}},null,{"$f":"VLOOKUP(MAX(Q123,AN123,AS123)/AJ123,VSGMSG8!$B$5:$I$11,7)","v":6},{"$f":"VLOOKUP(MAX(Q123,AN123,AS123)/AJ123,VSGMSG8!$B$12:$I$17,7)","v":5},{"$f":"VLOOKUP(MAX(Q123,AN123,AS123)/AJ123,VSGMSG8!$B$18:$I$23,7)","v":5},{"$f":"VLOOKUP(MAX(Q123,AN123,AS123)/AJ123,VSGMSG8!$B$24:$I$29,7)","v":5},{"$f":"VLOOKUP(MAX(Q123,AN123,AS123)/AJ123,LVL!A$5:F$14,5)","v":7},{"$f":"VLOOKUP(MAX(Q123,AN123,AS123)/AJ123,LVL!A$15:F$26,5)","v":6},{"$f":"VLOOKUP(MAX(Q123,AN123,AS123)/AJ123,LVL!A$27:F$33,5)","v":2},{"$f":"VLOOKUP(MAX(Q123,AN123,AS123)/AJ123,Glulam!$A$5:$D$20,4)","v":5},{"$f":"VLOOKUP(MAX(Q123,AN123,AS123)/AJ123,Glulam!$A$12:$D$20,4)","v":5},{"$f":"VLOOKUP(MAX(Q123,AN123,AS123),Steel!$E$64:$G$84,3)","v":3},{"$f":"VLOOKUP(MAX(Q123,AN123,AS123),Steel!$E$26:$G$35,3)","v":3},{"$f":"VLOOKUP(MAX(Q123,AN123,AS123),Flitch!$B$5:$F$10,5)","v":3},{"$f":"VLOOKUP(MAX(Q123,AN123,AS123),Flitch!$B$44:$F$54,5)","v":5},null,null,1,null,null,{"$f":"IF($P$113=1,J123*Span_2^2/4+(1.2*I123+G123)*Overhang*Span_2,IF($P$113=2,0,IF($P$113=3,0.5*Span_2,J123*(LDcant+Overhang)*Span_2)))","v":0},{"$f":"IF(P$113=1,0.128*AM123*Span_2,IF(P$113=2,0,AM123*Span_2/8))","v":0},null,null,{"$f":"IF($P$113=2,J123*Span_2^2/4+(1.2*I123+G123)*Overhang*Span_2,0)","v":0},0,{"$f":"IF(P$113=2,0.333*AQ123*Span_2+AR123*Span_2,0)","v":0},{"$f":"AQ123+AR123","v":0}]
[8,".9G+W",{"$f":"VLOOKUP((2+'Basic data'!M$5),'Basic data'!$G$7:$Y$14,7)","v":0.4},null,null,null,{"$f":"VLOOKUP('Basic data'!I$5,'Basic data'!$G$7:$Y$14,3)*'Basic data'!D$20*'Basic data'!F$20*'Basic data'!G$20","v":1.8559999999999999},{"$f":"VLOOKUP('Basic data'!I$5,'Basic data'!$G$7:$Y$14,3)*'Basic data'!E$20*'Basic data'!F$20*'Basic data'!G$20","v":1.1135999999999999},{"$f":"C124/VLOOKUP('Basic data'!V$5,'Basic data'!$G$7:$Y$14,16)","v":0.41411047216403324},{"$f":"0.9*I124-H124","v":-0.74090057505237006},null,null,null,null,{"$f":"IF(OR($P$113=1,$P$113=2),J124*Span^2/4-(G124-0.9*I124)*Overhang*Span,IF(P113=3,J124*(LD+Overhang)*Span,0.9*0.5*Span))","v":-5.7790244854084865},0,{"$f":"ABS(IF(OR(P$113=1,P$113=2),0.333*O124*Span+P124*Span,0.5*O124*Span+P124*Span))","v":8.6685367281127306},{"$f":"O124+P124","v":-5.7790244854084865},{"$f":"R124-Q124/BSpan","v":{"$error":"#DIV/0!"}},null,{"$f":"VLOOKUP(MAX(Q124,AN124,AS124)/AJ124,VSGMSG8!$C$5:$H$11,6)","v":6},{"$f":"VLOOKUP(MAX(Q124,AN124,AS124)/AJ124,VSGMSG8!$C$12:$H$17,6)","v":4},{"$f":"VLOOKUP(MAX(Q124,AN124,AS124)/AJ124,VSGMSG8!$C$18:$H$23,6)","v":3},{"$f":"VLOOKUP(MAX(Q124,AN124,AS124)/AJ124,VSGMSG8!$C$24:$H$29,6)","v":3},{"$f":"VLOOKUP(MAX(Q124,AN124,AS124)/AJ124,LVL!B$5:F$14,4)","v":5},{"$f":"VLOOKUP(MAX(Q124,AN124,AS124)/AJ124,LVL!B$15:F$26,4)","v":3},{"$f":"VLOOKUP(MAX(Q124,AN124,AS124)/AJ124,LVL!B$27:F$33,4)","v":0},{"$f":"VLOOKUP(MAX(Q124,AN124,AS124)/AJ124,Glulam!$A$5:$D$20,4)","v":2},{"$f":"VLOOKUP(MAX(Q124,AN124,AS124)/AJ124,Glulam!$A$12:$D$20,4)","v":2},{"$f":"VLOOKUP(MAX(Q124,AN124,AS124),Steel!$D$39:$G$59,4)","v":1},{"$f":"VLOOKUP(MAX(Q124,AN124,AS124),Steel!$D$26:$G$35,4)","v":2},{"$f":"VLOOKUP(MAX(Q124,AN124,AS124),Flitch!$C$5:$F$10,4)","v":1},{"$f":"VLOOKUP(MAX(Q124,AN124,AS124),Flitch!$C$44:$F$54,4)","v":1},null,null,1,null,null,{"$f":"IF($P$113=1,J124*Span_2^2/4-(G124-0.9*I124)*Overhang*Span_2,IF($P$113=2,0,IF($P$113=3,0.5*Span_2,J124*(LDcant+Overhang)*Span_2)))","v":0},{"$f":"ABS(IF(P$113=1,0.128*AM124*Span_2,IF(P$113=2,0,AM124*Span_2/8)))","v":0},null,null,{"$f":"IF($P$113=2,J124*Span_2^2/4+(0.9*I124-G124)*Overhang*Span_2,0)","v":0},0,{"$f":"ABS(IF(P$113=2,0.333*AQ124*Span_2+AR124*Span_2,0))","v":0},{"$f":"AQ124+AR124","v":0}]
[9,"1.2G+yQ+S",{"$f":"VLOOKUP('Basic data'!M$5,'Basic data'!$G$7:$Y$14,7)","v":0.85},null,0,{"$f":"'Input beam data'!$O$9*VLOOKUP('Basic data'!$V$5,'Basic data'!$G$7:$Y$14,17)","v":0},null,null,{"$f":"C125/VLOOKUP('Basic data'!V$5,'Basic data'!$G$7:$Y$14,16)","v":0.87998475334857051},{"$f":"1.2*I125+E125+F125","v":1.0559817040182846},null,null,null,null,{"$f":"IF(OR($P$113=1,$P$113=2),J125*Span^2/4+J125*Overhang*Span,IF(P113=3,J125*(LD+Overhang)*Span,1.2*0.5*Span))","v":8.2366572913426204},0,{"$f":"IF(OR(P$113=1,P$113=2),0.333*O125*Span+P125*Span,0.5*O125*Span+P125*Span)","v":12.354985937013931},{"$f":"O125+P125","v":8.2366572913426204},{"$f":"R125+Q125/BSpan","v":{"$error":"#DIV/0!"}},null,{"$f":"VLOOKUP(MAX(Q125,AN125,AS125)/AJ125,VSGMSG8!$B$5:$I$11,7)","v":6},{"$f":"VLOOKUP(MAX(Q125,AN125,AS125)/AJ125,VSGMSG8!$B$12:$I$17,7)","v":5},{"$f":"VLOOKUP(MAX(Q125,AN125,AS125)/AJ125,VSGMSG8!$B$18:$I$23,7)","v":4},{"$f":"VLOOKUP(MAX(Q125,AN125,AS125)/AJ125,VSGMSG8!$B$24:$I$29,7)","v":5},{"$f":"VLOOKUP(MAX(Q125,AN125,AS125)/AJ125,LVL!A$5:F$14,5)","v":6},{"$f":"VLOOKUP(MAX(Q125,AN125,AS125)/AJ125,LVL!A$15:F$26,5)","v":5},{"$f":"VLOOKUP(MAX(Q125,AN125,AS125)/AJ125,LVL!A$27:F$33,5)","v":1},{"$f":"VLOOKUP(MAX(Q125,AN125,AS125)/AJ125,Glulam!$A$5:$D$20,4)","v":4},{"$f":"VLOOKUP(MAX(Q125,AN125,AS125)/AJ125,Glulam!$A$12:$D$20,4)","v":4},{"$f":"VLOOKUP(MAX(Q125,AN125,AS125),Steel!$E$64:$G$84,3)","v":2},{"$f":"VLOOKUP(MAX(Q125,AN125,AS125),Steel!$E$26:$G$35,3)","v":3},{"$f":"VLOOKUP(MAX(Q125,AN125,AS125),Flitch!$B$5:$F$10,5)","v":2},{"$f":"VLOOKUP(MAX(Q125,AN125,AS125),Flitch!$B$44:$F$54,5)","v":2},null,null,0.8,null,null,{"$f":"IF($P$113=1,J125*Span_2^2/4+J125*Overhang*Span_2,IF($P$113=2,0,IF($P$113=3,0.5*Span_2,J125*(LDcant+Overhang)*Span_2)))","v":0},{"$f":"IF(P$113=1,0.128*AM125*Span_2,IF(P$113=2,0,AM125*Span_2/8))","v":0},null,null,{"$f":"IF($P$113=2,J125*Span_2^2/4+J125*Overhang*Span_2,0)","v":0},0,{"$f":"IF(P$113=2,0.333*AQ125*Span_2+AR125*Span_2,0)","v":0},{"$f":"AQ125+AR125","v":0}]
[null,null,null,null,null,null,null,null,null,null,null,null,null,null,null,null,"Min:",{"$f":"MIN(R117:R125)","v":-5.7790244854084865},null,"Max:",{"$f":"MAX(U117:U125)","v":6},5,5,5,9,8,4,6,6,4,4,{"$f":"MAX(AF117:AF125)","v":4},{"$f":"MAX(AG117:AG125)","v":6},null,null,null,null,null,null,null,null,null,null,null,"Min:",{"$f":"MIN(AT117:AT125)","v":0}]

{"sheet":"Basic data","index":10,"n_rows":79,"n_cols":41,"rows_kept":79,"cut":false,"hidden":true,"merged":[[4,39,5,39],[4,37,5,37],[4,30,5,30],[4,31,5,31],[3,28,5,28],[3,29,5,29],[4,32,5,32],[18,8,18,9],[23,8,23,9],[18,10,18,11],[31,16,31,25],[29,13,32,13],[49,16,49,25],[48,13,49,13],[45,0,47,0],[36,16,36,23],[44,16,44,23],[33,13,37,13],[38,13,43,13],[45,13,46,13],[43,0,44,0],[34,16,34,25]]}
["Basic data from AS/NZS 1170 and/or NZS 3604"]
["This is the only sheet where data should be changed.  Ensure all yellow cells are appropriate for the use of the spreadsheet."]
[null,null,null,null,null,null,null,null,null,null,null,null,null,null,null,null,null,null,null,null,null,null,null,null,null,null,"Table of options for foundation",null,null,"See also Range (AB5:AH16) in \"Results\""]
[null,null,null,null,null,"Col no.",1,2,3,4,5,6,7,8,9,10,11,12,13,14,15,16,17,18,19,null,null,null,"Internal pad footing (timber floor)","Foundation wall with timber subfloor",null,null,null,null,null,"Table of options for supports"]
[null,{"$f":"T5","v":1},null,null,null,null,"Cell links",null,3,1,null,null,2,null,1,null,1,null,null,1,{"$f":"MAX(V5-1,1)","v":2},3,null,null,2,null,null,null,null,null,"Concrete slab edging","Local slab thickening","External pad footing",null,null,null,null,"Prop studs","Post","Wall studs","Pile"]
["Index","Application","Results index","Application",null,null,"Index","Wind zone","(kPa)","Snow region","sg (kPa)","Roof","(kPa)","Wall","(kPa)","Floor/live load","(kPa)","Floor load","(kPa)","Application","Roof slope","Cos","m1","Wall ht","(m)",null,null,null,null,null,null,null,null,"Pile footing"]
[1,"Lintel, roof only",14,0,null,null,1,"Low",0.61,"Region N0",0,"Light",0.4,"Light",0.2,"1.5 kPa",1.5,"Internal",0.4,"Lintel, roof only",5,{"$f":"COS(RADIANS(U7))","v":0.99619469809174555},{"$f":"MIN(0.7,0.7*(60-0)/50)","v":0.7},"2.4 m",2.4,null,"Lintel, roof only",1,"y","y","y","y","n","n",null,"Lintel, roof only",1,"y","n","n","n"]
[2,"Lintel, roof and wall",28,14,null,null,2,"Medium",0.82,"Region N1",{"$f":"IF(U18<400,0,3*(U18-250)/1000)","v":0},"Heavy",0.85,"Medium",0.8,"2.0 kPa",2,"Deck",0.4,"Lintel, roof and wall",10,0.98480775301220802,{"$f":"MIN(0.7,0.7*(60-U7)/50)","v":0.7},"2.7 m",2.7,null,"Lintel, roof and wall",2,"y","y","y","y","n","n",null,"Lintel, roof and wall",2,"y","n","n","n"]
[3,"Lintel, roof wall and floor",{"$f":"C8+C$7","v":42},28,null,null,3,"High",1.1599999999999999,"Region N2",{"$f":"IF(U$18<200,0,3.4*(U$18-150)/1000)","v":0},"L(W)",0.2,"L(W)",0.1,"3.0 kPa",3,null,null,"Lintel, roof wall and floor",15,0.96592582628906831,{"$f":"MIN(0.7,0.7*(60-U8)/50)","v":0.7},"3.0 m",3,null,"Lintel, roof wall and floor",3,"y","y","y","y","n","n",null,"Lintel, roof wall and floor",3,"y","n","n","n"]
[4,"Verandah beam",56,42,null,null,4,"Very high",1.5,"Region N3",{"$f":"IF(U$18<150,0,3.8*(U$18-150)/1000)","v":0},"H(W)",0.4,"M(W)",0.2,null,null,null,null,"Verandah beam",30,0.86602540378443871,{"$f":"MIN(0.7,0.7*(60-U9)/50)","v":0.62999999999999989},null,null,null,"Verandah beam",4,"y","n","y","y","y","y",null,"Verandah beam",4,"n","y","y","n"]
[5,"Floor beam",70,56,null,null,5,"Extra high",1.82,"Region N4",{"$f":"MAX(IF(U$18<400,1.5*(3*U$18/1000+0.3),1.5*(2*U$18/1000+0.7)),0.9)","v":0.9},"Live",0.25,"Heavy",0.7,null,null,null,null,"Floor beam",45,0.70710678118654757,{"$f":"MIN(0.7,0.7*(60-U10)/50)","v":0.42},null,null,null,"Floor beam",5,"y","y","y","y","n","n",null,"Floor beam",5,"n","n","y","n"]
[6,"Deck beam/bearer",84,70,null,null,6,"60 m/sec",2.16,"Region N5",{"$f":"MAX(IF(U$18<400,1.5*(1.5*U$18/1000+0.3),1.5*(2*U$18/1000+0.1)),0.9)","v":0.9},"L(VW)",0.1,null,null,null,null,null,null,"Deck beam/bearer",60,0.50000000000000011,{"$f":"MIN(0.7,0.7*(60-U11)/50)","v":0.21},null,null,null,"Deck beam/bearer",6,"n","n","n","n","y","y",null,"Deck beam/bearer",6,"n","y","n","y"]
[7,"Ridge/roof beam",98,84,null,null,7,"65 m/sec",2.54,null,null,"H(VW)",0.4,null,null,null,null,null,null,"Ridge/roof beam",null,null,null,null,null,null,"Ridge/roof beam",7,"y","y","y","y","n","n",null,"Ridge/roof beam",7,"n","n","y","n"]
[8,"Garage door lintel",112,98,null,null,8,"70 m/sec",2.94,null,null,null,null,null,null,null,null,null,null,"Garage door lintel",null,null,1,"Less than 5 degrees",null,null,"Garage door lintel",8,"n","n","y","n","n","n",null,"Garage door lintel",8,"y","n","n","n"]
[9,"Cantilever lintel",126,112,null,null,9,null,null,null,null,null,null,null,null,null,null,null,null,"Cantilever lintel",null,null,2,"5 to 10 degrees",null,null,"Cantilever lintel",9,"y","y","y","y","n","n",null,"Cantilever lintel",9,"y","n","n","n"]
[{"$f":"IF(OR(T5=1,T5=4,T5=7,T5=8),\"Userform1\",IF(T5=2,\"Userform2\",IF(T5=3,\"Userform3\",IF(T5=9,\"Userform6\",\"Userform4\"))))","v":"Userform1"},null,"Wind factors",null,null,null,null,null,null,null,null,null,null,null,null,"Load cases",null,null,null,null,null,null,3,"10 to 15 degrees"]
[{"$f":"IF(OR(T5=1,T5=2,T5=3,T5=8),1,0)","v":1},null,"Internal factors",null,null,null,null,"Wall factors","Timber properties",null,null,null,null,null,null,1,"G+Ql",null,null,"Elevation",1,3,4,"15 to 30 degrees",null,null,null,null,null,null,null,null,null,null,null,null,null,"Input data for choice of support on front page"]
[null,null,"Case",null,"Cp(r)","Kc","Ka","Cp","VSGMSG8 and Glulam",null,null,null,null,null,null,2,"G+Qs",null,null,"< 100m",{"$f":"U17*100","v":100},2,5,"30 to 45 degrees",null,null,null,null,null,null,"Isolated pad footing ",null,null,null,null,null,null,{"$f":"IF(VLOOKUP($T$5,$AK$7:$AO$15,2)=\"y\",AL5,\"\")","v":"Prop studs"}]
[null,null,7,0.2,0.5,1,1,0.65,"Dry",null,"Green",null,null,null,null,3,"Spare",null,null,"101 - 200m",null,2,6,"45 to 60 degrees",null,null,null,null,null,null,"Foundation wall with timber sub-floor",null,null,null,null,null,null,{"$f":"IF(VLOOKUP($T$5,$AK$7:$AO$15,3)=\"y\",AM5,\"\")","v":""}]
[null,null,8,{"$f":"0.9+0.7","v":1.6},0.96,1,1,1,"fc","fp","fc","fp",null,null,null,4,"G+S",null,null,"201 - 300m",null,-1,null,null,null,null,null,null,null,null,"Concrete slab edging",null,null,null,null,null,null,{"$f":"IF(VLOOKUP($T$5,$AK$7:$AO$15,4)=\"y\",AN5,\"\")","v":""}]
[null,null,"Verandah factors",null,null,null,null,null,18,8.9,12,5.3,null,null,null,5,"1.35G",null,null,"301 - 400m",null,1,null,null,null,null,null,null,null,null,"Local slab thickening",null,null,null,null,null,null,{"$f":"IF(VLOOKUP($T$5,$AK$7:$AO$15,5)=\"y\",AO5,\"\")","v":""}]
[null,null,"Case","Cp",null,"Kc","Ka",null,null,null,null,null,null,null,null,6,"1.2G+1.5Q",null,null,"401 - 500m",null,null,null,null,null,null,null,null,null,null,"Input data for choice of foundation on front page"]
[null,null,7,0.2,null,1,1,null,"LVL",null,null,null,null,null,null,7,"1.2G+yQ+W",null,null,"501 - 600m",null,null,null,null,null,null,null,null,null,null,{"$f":"IF(VLOOKUP($T$5,$AB$7:$AH$15,2)=\"y\",AC4,\"\")","v":"Internal pad footing (timber floor)"}]
[null,null,8,{"$f":"0.9+0.7","v":1.6},null,1,1,null,"Dry",null,null,null,null,null,null,8,".9G+W",null,null,"601 - 700m",null,0,null,null,null,"Cantilever configurations:","1 = Hip roof, cantilever span and supported span",null,null,null,{"$f":"IF(VLOOKUP($T$5,$AB$7:$AH$15,3)=\"y\",AD4,\"\")","v":"Foundation wall with timber subfloor"}]
[null,null,null,null,null,null,null,null,"fc","fp",null,null,null,null,null,9,"1.2G+yQ+S",null,null,"701 - 800m",null,null,null,null,null,null,"2 = Hip roof, 2 cantilever spans (not necessarily equal)",null,null,null,{"$f":"IF(VLOOKUP($T$5,$AB$7:$AH$15,4)=\"y\",AE5,\"\")","v":"Concrete slab edging"}]
[null,null,null,null,null,null,null,null,28,10,null,null,null,null,null,null,null,null,null,"801 - 900m",null,null,null,null,null,null,"3 = Gable roof, cantilever span load bearing",null,null,null,{"$f":"IF(VLOOKUP($T$5,$AB$7:$AH$15,5)=\"y\",AF5,\"\")","v":"Local slab thickening"}]
[null,null,null,null,null,null,null,null,null,null,null,null,null,null,null,null,null,null,null,null,null,null,null,null,null,null,"4 = Gable roof, supported span load bearing",null,null,null,{"$f":"IF(VLOOKUP($T$5,$AB$7:$AH$15,6)=\"y\",AG5,\"\")","v":""}]
[null,null,"Support capacity (assumed 2.7m long)",null,null,null,null,null,null,null,null,null,null,null,"End fixings",null,null,null,null,null,null,null,null,null,null,null,null,null,null,null,{"$f":"IF(VLOOKUP($T$5,$AB$7:$AH$15,7)=\"y\",AH6,\"\")","v":""}]
[null,"Application","kN",null,null,null,null,null,null,null,null,null,null,null,"kN"]
[null,"1, 2, 3, 8, 9",6,1,"15 - 20 mm deep check-out of trimmer stud (see fig 8.12 of NZS 3604)",null,null,null,null,null,null,null,null,"Lintels",2.1,1,"4 end nails only to trimmer stud"]
[null,null,10.9,2,"Single prop stud (90x45)",null,null,null,null,null,null,null,null,null,6.16,2,"25x0.9 mm nail strap with 6/30x3.15 nails (see Figure 8.12 NZS 3604)"]
[null,null,21.9,3,"Double prop stud (2/90x45)",null,null,null,null,null,null,null,null,null,9.9600000000000009,3,"2/25x0.9 mm nail straps with 12/30x3.15 nails \n(see Figure 8.12 NZS 3604)"]
[null,"4, 6",17.5,4,"90x90 post (max ht 3.0m)",null,null,null,null,null,null,null,null,null,13.65,4,"Welded cleat with 2/M12 bolts or coach screws into trimmer stud"]
[null,"5, 7",10.9,5,"Single stud (90x45)",null,null,null,null,null,null,null,null,"Veranda and deck beams",4.75,5,"6/100x4 nails to post \n(2/M12 bolts where beam is continuous over notched post)"]
[null,null,21.9,6,"Double studs (2/90x45)",null,null,null,null,null,null,null,null,null,4.87,6,"1/M12 bolt to post  (similar to Figure 9.3 (C) of NZS 3604)  (2/M12 bolts where beam is continuous over notched post)"]
[null,null,32.799999999999997,7,"Triple studs (3/90x45)",null,null,null,null,null,null,null,null,null,9.76,7,"2/M12 bolts to post (see Figure 9.3 (C) of NZS 3604)  (3/M16 bolts where beam is continuous over notched post)"]
[null,6,42,8,"125x125 pile (max ht 3.0m)",null,null,null,null,null,null,null,null,null,19.5,8,"Steel bracket each side of beam with 2/M12 bolts to beam and post  (see Figure 9.3 (B) of NZS3604)  "]
[null,null,null,9,"Support requires specific engineering design",null,null,null,null,null,null,null,null,null,13.65,9,"Welded cleat with 2/M12 bolts or coach screws into post"]
[null,null,null,10,"Full support on top of post required (Figure 9.3 (a) or (b) of NZS 3604)",null,null,null,null,null,null,null,null,"Ridge beams",1.58,10,"2/100x4 nails (or 4/90x3.15)"]
[null,null,null,null,null,null,null,null,null,null,null,null,null,null,3.17,11,"4/100x4 nails (or 6/90x3.15)"]
["Durability",null,null,null,null,null,null,null,null,null,null,null,null,null,4.75,12,"6/100x4 nails (or 10/90x3.15)"]
[null,null,null,null,null,null,null,null,null,null,null,null,null,null,9.76,13,"1/M12 bolt to built up studs"]
["Fixings","Refer to Tables 4.1, 4.2 and 4.3 in the current NZS 3604 to determine suitable fixing types for the building location and B2 Durability requirements",null,null,null,null,null,null,null,null,null,null,null,null,26,14,"2/M16 bolts to built up studs"]
["Timber","Timber beam treated to H1.2",null,null,null,null,null,null,null,null,null,null,null,null,13.65,15,"Welded cleat with 2/M12 bolts or coach screws into built-up studs"]
[null,"Timber beam treated to H3.2 (Fixings in accordance with Tables 4.2 and 4.3 of NZS 3604)",null,null,null,null,null,null,null,null,null,null,null,null,null,16,"Fixing against wind uplift requires specific engineering design "]
["Steel","Steel beam to be wire brushed and primed",null,null,null,null,null,null,null,null,null,null,null,"Floor beams",null,17,"Bolt beam to support studs"]
[null,"Corrosion protection of steel beam requires Specific Engineering Design",null,null,null,null,null,null,null,null,null,null,null,null,null,18,"4/100x4 nails (or 6/90x3.15)"]
[null,null,null,null,null,null,null,null,null,null,null,null,null,"Deck beams",null,19,"4/100x4 skew nails into pile"]
[null,null,null,null,null,null,null,null,null,null,null,null,null,"Cantilever lintels",6.16,20,"25x0.9 mm nail strap with 6/30x3.15 nails (see Figure 8.12 NZS 3604)"]
["Flitch beam specifications",null,null,null,null,null,null,null,null,null,null,null,null,null,9.9600000000000009,21,"2/25x0.9 mm nail straps with 12/30x3.15 nails \n(see Figure 8.12 NZS 3604)"]
[]
["refer to Mitek NZ for details (www.miteknz.co.nz)"]
["refer to Pryda NZ for details (www.pryda.co.nz)"]
[]
[]
[]
[]
[]
[]
[]
[null,null,null,null,null,null,null,null,null,null,null,null,null,null,"Foundation fixings"]
[]
[null,null,null,null,null,null,null,null,null,null,null,null,null,"Studs/found wall",2.5,1,"No specific fixing required. (NZS 3604 standard details with normal lining fixings)"]
[null,null,null,null,null,null,null,null,null,null,null,null,null,null,3.8,2,"25x0.9 mm nail strap folded under wall plate, attached to stud with 6/30x3.15 nails, 15kN bolt, plate to foundation wall"]
[null,null,null,null,null,null,null,null,null,null,null,null,null,null,7.6,3,"2/25x0.9 mm nail straps folded under wall plate, attached to each stud with 6/30x3.15 nails (12 total), 15kN bolt, plate to foundation wall"]
[null,null,null,null,null,null,null,null,null,null,null,null,null,null,11.4,4,"3/25x0.9 mm nail straps folded under wall plate, attached to each stud with 6/30x3.15 nails (18 total), 15kN bolt, plate to foundation wall"]
[null,null,null,null,null,null,null,null,null,null,null,null,null,"Studs/pad",2.5,5,"No specific fixing required. (NZS 3604 standard details with normal lining fixings)   Directly support studs by dwang between floor joists"]
[null,null,null,null,null,null,null,null,null,null,null,null,null,null,7.6,6,"25x0.9 mm nail strap each side of stud attached to 90x90 jackstud, 6/30x3.15 nails each end of each strap (12 total), jackstud bolted to pad with bracket  "]
[null,null,null,null,null,null,null,null,null,null,null,null,null,null,15.2,7,"2/25x0.9 mm nail straps each side of stud attached to 90x90 jackstud, 6/30x3.15 nails each end of each strap (24 total), jackstud bolted to pad with bracket  "]
[null,null,null,null,null,null,null,null,null,null,null,null,null,null,18.600000000000001,8,"3/25x0.9 mm nail straps each side of stud attached to 2/140x45 jackstud, 6/30x3.15 nails each end of each strap (36 total), jackstud fixed with bracket cast into pad "]
[null,null,null,null,null,null,null,null,null,null,null,null,null,"Post/pad",12.8,9,"Bracket cast into foundation, with M12 bolt to post (Figure 9.2 NZS 3604)\n(2/M12 bolts where beam is continuous over post)"]
[null,null,null,null,null,null,null,null,null,null,null,null,null,null,25.5,10,"Bracket cast into foundation, with 2/M12 bolts to post (Figure 9.2 NZS 3604)\n(4/M12 bolts where beam is continuous over post)"]
[null,null,null,null,null,null,null,null,null,null,null,null,null,"Studs/slab",2.5,11,"No specific fixing required. (NZS 3604 standard details with normal lining fixings)"]
[null,null,null,null,null,null,null,null,null,null,null,null,null,null,7.6,12,"25x0.9 mm nail strap folded under plate, with 6/30x3.15 nails each side of stud (see Figure 8.12 NZS 3604), 15kN bolt, plate to slab"]
[null,null,null,null,null,null,null,null,null,null,null,null,null,null,{"$f":"2*O74","v":15.2},13,"2/25x0.9 mm nail straps folded under plate, with 6/30x3.15 nails each side of stud (similar Figure 8.12 NZS 3604), 15kN bolt, plate to slab"]
[null,null,null,null,null,null,null,null,null,null,null,null,null,null,22.8,14,"3/25x0.9 mm nail straps folded under plate, with 6/30x3.15 nails each side of stud (similar Figure 8.12 NZS 3604), 2/15kN bolts, plate to slab"]
[null,null,null,null,null,null,null,null,null,null,null,null,null,null,null,15,"Fixing to foundation requires specific engineering design"]
[null,null,null,null,null,null,null,null,null,null,null,null,null,null,null,16,"Not an appropriate foundation for this application"]
[null,null,null,null,null,null,null,null,null,null,null,null,null,null,null,17,"Pile cast into footing as per NZS 3604"]

{"sheet":"Results","index":11,"n_rows":52,"n_cols":34,"rows_kept":52,"cut":false,"hidden":true,"merged":[[12,0,13,0],[24,4,24,5],[4,28,5,28],[4,29,5,29],[19,9,22,26],[4,32,5,32],[4,33,5,33],[4,30,5,30],[4,31,5,31],[5,0,6,0]]}
["A","This sheet takes the results from the load calculation and sorts and enables data required for selecting an option by the user."]
["B","It then takes the results of that selection and calculates deflection, required supports and fixings"]
[null,null,null,null,null,null,null,null,null,null,null,null,null,null,null,null,null,null,null,null,null,null,null,null,null,null,null,"Foundations options"]
["A",null,null,null,null,null,null,null,null,null,null,null,null,null,null,null,null,null,null,null,null,null,null,null,null,null,"End 1",3,"Foundation fixings"]
[null,null,"Selection",null,null,null,null,null,"Faceload results",null,null,"Data for input forms",null,null,null,null,null,null,null,null,null,null,null,null,null,null,"End 2",3,"Internal pad footing (with timber floor)","Foundation wall with timber sub-floor","Concrete slab edging (NZS3604)","Local slab thickening","External pad footing","Pile footing"]
["Timber \n(VSG/MSG8)",{"$f":"IF('Basic data'!T5=1,VLOOKUP(INDEX(Calc!$AO$14:$BA$27,Results!I6,1),VSGMSG8!H5:I11,2),VLOOKUP(INDEX(Calc!$U$1:$AE$126,'Basic data'!$T$5*14,1),VSGMSG8!H5:I11,2))","v":"290x45"},1,"140x45",{"$f":"IF(D6=\"\",\"\",D6&IF(MATCH(D6,Combined!B$5:B$109,0)<22,\"  VSG/MSG8 (SG8)\",IF(AND(MATCH(D6,Combined!B$5:B$109,0)>21,MATCH(D6,Combined!B$5:B$109,0)<48),\"  LVL\",IF(AND(MATCH(D6,Combined!B$5:B$109,0)>47,MATCH(D6,Combined!B$5:B$109,0)<62),\"  Glulam\",IF(AND(MATCH(D6,Combined!B$5:B$109,0)>90,MATCH(D6,Combined!B$5:B$109,0)<96),\"  Mitek flitch beam\",IF(MATCH(D6,Combined!B$5:B$109,0)>95,\"  Pryda flitch beam\",\"\"))))))","v":"140x45  VSG/MSG8 (SG8)"},null,null,null,1,{"$f":"MAX('Face loads'!F7,'Face loads'!I7)","v":1},null,null,"Opt1","Opt2","Opt3","Opt4","Opt5","Opt6",null,null,null,null,null,null,null,"End 1",{"$f":"IF($AB$4=1,AC5,IF($AB$4=2,AD5,IF($AB$4=3,AE5,IF($AB$4=4,AF5,IF($AB$4=5,AG5,AH5)))))","v":"Concrete slab edging (NZS3604)"}]
[null,{"$f":"IF('Basic data'!T5=1,VLOOKUP(INDEX(Calc!$AO$14:$BA$27,Results!I7,2),VSGMSG8!H12:I17,2),VLOOKUP(INDEX(Calc!$U$1:$AE$126,'Basic data'!$T$5*14,2),VSGMSG8!H12:I17,2))","v":"290x70"},2,"140x70",{"$f":"IF(D7=\"\",\"\",D7&IF(MATCH(D7,Combined!B$5:B$109,0)<22,\"  VSG/MSG8 (SG8)\",IF(AND(MATCH(D7,Combined!B$5:B$109,0)>21,MATCH(D7,Combined!B$5:B$109,0)<48),\"  LVL\",IF(AND(MATCH(D7,Combined!B$5:B$109,0)>47,MATCH(D7,Combined!B$5:B$109,0)<62),\"  Glulam\",IF(AND(MATCH(D7,Combined!B$5:B$109,0)>90,MATCH(D7,Combined!B$5:B$109,0)<96),\"  Mitek flitch beam\",IF(MATCH(D7,Combined!B$5:B$109,0)>95,\"  Pryda flitch beam\",\"\"))))))","v":"140x70  VSG/MSG8 (SG8)"},null,null,null,1,{"$f":"MAX('Face loads'!F8,'Face loads'!I8)","v":0},null,"Roofwt",false,true,null,null,null,null,null,null,null,null,null,null,null,"End 2",{"$f":"IF($AB$5=1,AC5,IF($AB$5=2,AD5,IF($AB$5=3,AE5,IF($AB$5=4,AF5,IF($AB$5=5,AG5,AH5)))))","v":"Concrete slab edging (NZS3604)"},null,1,2,3,4,5,6]
[null,{"$f":"IF('Basic data'!T5=1,VLOOKUP(INDEX(Calc!$AO$14:$BA$27,Results!I8,3),VSGMSG8!H18:I23,2),VLOOKUP(INDEX(Calc!$U$1:$AE$126,'Basic data'!$T$5*14,3),VSGMSG8!H18:I23,2))","v":"2/240x45"},3,"2/90x45",{"$f":"IF(D8=\"\",\"\",D8&IF(MATCH(D8,Combined!B$5:B$109,0)<22,\"  VSG/MSG8 (SG8)\",IF(AND(MATCH(D8,Combined!B$5:B$109,0)>21,MATCH(D8,Combined!B$5:B$109,0)<48),\"  LVL\",IF(AND(MATCH(D8,Combined!B$5:B$109,0)>47,MATCH(D8,Combined!B$5:B$109,0)<62),\"  Glulam\",IF(AND(MATCH(D8,Combined!B$5:B$109,0)>90,MATCH(D8,Combined!B$5:B$109,0)<96),\"  Mitek flitch beam\",IF(MATCH(D8,Combined!B$5:B$109,0)>95,\"  Pryda flitch beam\",\"\"))))))","v":"2/90x45  VSG/MSG8 (SG8)"},null,null,null,1,{"$f":"MAX('Face loads'!F9,'Face loads'!I9)","v":0},null,"Roofslope",false,false,true,false,false,false,null,null,null,null,null,null,null,null,"Lintel, roof only",1,{"$f":"IF($F$34<'Basic data'!$O$67,5,IF($F$34<'Basic data'!$O$68,6,IF($F$34<'Basic data'!$O$69,7,IF($F$34<'Basic data'!$O$70,8,15))))","v":6},{"$f":"IF($F$34<'Basic data'!$O$63,1,IF($F$34<'Basic data'!$O$64,2,IF($F$34<'Basic data'!$O$65,3,IF($F$34<'Basic data'!$O$66,4,15))))","v":2},{"$f":"IF($F$34<'Basic data'!$O$73,11,IF($F$34<'Basic data'!$O$74,12,IF($F$34<'Basic data'!$O$75,13,IF($F$34<'Basic data'!$O$76,14,15))))","v":12},{"$f":"IF($F$34<'Basic data'!$O$73,11,IF($F$34<'Basic data'!$O$74,12,IF($F$34<'Basic data'!$O$75,13,IF($F$34<'Basic data'!$O$76,14,15))))","v":12},16,16]
[null,{"$f":"IF('Basic data'!T5=1,VLOOKUP(INDEX(Calc!$AO$14:$BA$27,Results!I9,4),VSGMSG8!H24:I29,2),VLOOKUP(INDEX(Calc!$U$1:$AE$126,'Basic data'!$T$5*14,4),VSGMSG8!H24:I29,2))","v":"240x90"},4,"140x90",{"$f":"IF(D9=\"\",\"\",D9&IF(MATCH(D9,Combined!B$5:B$109,0)<22,\"  VSG/MSG8 (SG8)\",IF(AND(MATCH(D9,Combined!B$5:B$109,0)>21,MATCH(D9,Combined!B$5:B$109,0)<48),\"  LVL\",IF(AND(MATCH(D9,Combined!B$5:B$109,0)>47,MATCH(D9,Combined!B$5:B$109,0)<62),\"  Glulam\",IF(AND(MATCH(D9,Combined!B$5:B$109,0)>90,MATCH(D9,Combined!B$5:B$109,0)<96),\"  Mitek flitch beam\",IF(MATCH(D9,Combined!B$5:B$109,0)>95,\"  Pryda flitch beam\",\"\"))))))","v":"140x90  VSG/MSG8 (SG8)"},null,null,null,1,{"$f":"MAX('Face loads'!F10,'Face loads'!I10)","v":0},null,"Wallwt",true,false,null,null,null,null,null,null,null,null,null,null,null,null,"Lintel, roof and wall",2,{"$f":"IF($F$34<'Basic data'!$O$67,5,IF($F$34<'Basic data'!$O$68,6,IF($F$34<'Basic data'!$O$69,7,IF($F$34<'Basic data'!$O$70,8,15))))","v":6},{"$f":"IF($F$34<'Basic data'!$O$63,1,IF($F$34<'Basic data'!$O$64,2,IF($F$34<'Basic data'!$O$65,3,IF($F$34<'Basic data'!$O$66,4,15))))","v":2},{"$f":"IF($F$34<'Basic data'!$O$73,11,IF($F$34<'Basic data'!$O$74,12,IF($F$34<'Basic data'!$O$75,13,IF($F$34<'Basic data'!$O$76,14,15))))","v":12},{"$f":"IF($F$34<'Basic data'!$O$73,11,IF($F$34<'Basic data'!$O$74,12,IF($F$34<'Basic data'!$O$75,13,IF($F$34<'Basic data'!$O$76,14,15))))","v":12},16,16]
["LVL",{"$f":"IF('Basic data'!T5=1,VLOOKUP(INDEX(Calc!$AO$14:$BA$27,Results!I10,5),LVL!E5:F14,2),IF('Basic data'!T5=6,\"NA\",VLOOKUP(INDEX(Calc!$U$1:$AE$126,'Basic data'!$T$5*14,5),LVL!E5:F14,2)))","v":"240 x45"},5,"90 x45",{"$f":"IF(D10=\"\",\"\",D10&IF(MATCH(D10,Combined!B$5:B$109,0)<22,\"  VSG/MSG8\",IF(AND(MATCH(D10,Combined!B$5:B$109,0)>21,MATCH(D10,Combined!B$5:B$109,0)<48),\"  LVL\",IF(AND(MATCH(D10,Combined!B$5:B$109,0)>47,MATCH(D10,Combined!B$5:B$109,0)<62),\"  Glulam\",IF(AND(MATCH(D10,Combined!B$5:B$109,0)>90,MATCH(D10,Combined!B$5:B$109,0)<96),\"  Mitek flitch beam\",IF(MATCH(D10,Combined!B$5:B$109,0)>95,\"  Pryda flitch beam\",\"\"))))))","v":"90 x45  LVL"},null,null,null,1,{"$f":"MAX('Face loads'!F11,'Face loads'!I11)","v":0},null,"Wallht",true,false,false,null,null,null,null,null,null,null,null,null,null,null,"Lintel, roof wall and floor",3,{"$f":"IF($F$34<'Basic data'!$O$67,5,IF($F$34<'Basic data'!$O$68,6,IF($F$34<'Basic data'!$O$69,7,IF($F$34<'Basic data'!$O$70,8,15))))","v":6},{"$f":"IF($F$34<'Basic data'!$O$63,1,IF($F$34<'Basic data'!$O$64,2,IF($F$34<'Basic data'!$O$65,3,IF($F$34<'Basic data'!$O$66,4,15))))","v":2},{"$f":"IF($F$34<'Basic data'!$O$73,11,IF($F$34<'Basic data'!$O$74,12,IF($F$34<'Basic data'!$O$75,13,IF($F$34<'Basic data'!$O$76,14,15))))","v":12},{"$f":"IF($F$34<'Basic data'!$O$73,11,IF($F$34<'Basic data'!$O$74,12,IF($F$34<'Basic data'!$O$75,13,IF($F$34<'Basic data'!$O$76,14,15))))","v":12},16,16]
[null,{"$f":"IF('Basic data'!T5=1,VLOOKUP(INDEX(Calc!$AO$14:$BA$27,Results!I11,6),LVL!E15:F26,2),IF('Basic data'!T5=6,\"NA\",VLOOKUP(INDEX(Calc!$U$1:$AE$126,'Basic data'!$T$5*14,6),LVL!E15:F26,2)))","v":"200x63"},6,"170x63",{"$f":"IF(D11=\"\",\"\",D11&IF(MATCH(D11,Combined!B$5:B$109,0)<22,\"  VSG/MSG8\",IF(AND(MATCH(D11,Combined!B$5:B$109,0)>21,MATCH(D11,Combined!B$5:B$109,0)<48),\"  LVL\",IF(AND(MATCH(D11,Combined!B$5:B$109,0)>47,MATCH(D11,Combined!B$5:B$109,0)<62),\"  Glulam\",IF(AND(MATCH(D11,Combined!B$5:B$109,0)>90,MATCH(D11,Combined!B$5:B$109,0)<96),\"  Mitek flitch beam\",IF(MATCH(D11,Combined!B$5:B$109,0)>95,\"  Pryda flitch beam\",\"\"))))))","v":"170x63  LVL"},null,null,null,1,{"$f":"MAX('Face loads'!F12,'Face loads'!I12)","v":0},null,"Floorload",true,false,false,null,null,null,null,null,null,null,null,null,null,null,"Verandah beam",4,{"$f":"IF($F$34<'Basic data'!$O$71,9,IF($F$34<'Basic data'!$O$72,10,15))","v":9},16,{"$f":"IF($F$34<'Basic data'!$O$71,9,IF($F$34<'Basic data'!$O$72,10,15))","v":9},{"$f":"IF($F$34<'Basic data'!$O$71,9,IF($F$34<'Basic data'!$O$72,10,15))","v":9},{"$f":"IF($F$34<'Basic data'!$O$71,9,IF($F$34<'Basic data'!$O$72,10,15))","v":9},17]
[null,{"$f":"IF('Basic data'!T5=1,VLOOKUP(INDEX(Calc!$AO$14:$BA$27,Results!I12,7),LVL!E27:F33,2),IF('Basic data'!$T$5=6,\"NA\",VLOOKUP(INDEX(Calc!$U$1:$AE$126,'Basic data'!$T$5*14,7),LVL!E27:F33,2)))","v":"200x90"},7,"150x90",{"$f":"IF(D12=\"\",\"\",D12&IF(MATCH(D12,Combined!B$5:B$109,0)<22,\"  VSG/MSG8\",IF(AND(MATCH(D12,Combined!B$5:B$109,0)>21,MATCH(D12,Combined!B$5:B$109,0)<48),\"  LVL\",IF(AND(MATCH(D12,Combined!B$5:B$109,0)>47,MATCH(D12,Combined!B$5:B$109,0)<62),\"  Glulam\",IF(AND(MATCH(D12,Combined!B$5:B$109,0)>90,MATCH(D12,Combined!B$5:B$109,0)<96),\"  Mitek flitch beam\",IF(MATCH(D12,Combined!B$5:B$109,0)>95,\"  Pryda flitch beam\",\"\"))))))","v":"150x90  LVL"},null,null,null,1,{"$f":"MAX('Face loads'!F13,'Face loads'!I13)","v":0},null,null,null,null,null,null,null,null,null,null,null,null,null,null,null,null,"Floor beam",5,{"$f":"IF($F$34<'Basic data'!$O$67,5,IF($F$34<'Basic data'!$O$68,6,IF($F$34<'Basic data'!$O$69,7,IF($F$34<'Basic data'!$O$70,8,15))))","v":6},{"$f":"IF($F$34<'Basic data'!$O$63,1,IF($F$34<'Basic data'!$O$64,2,IF($F$34<'Basic data'!$O$65,3,IF($F$34<'Basic data'!$O$66,4,15))))","v":2},{"$f":"IF($F$34<'Basic data'!$O$73,11,IF($F$34<'Basic data'!$O$74,12,IF($F$34<'Basic data'!$O$75,13,IF($F$34<'Basic data'!$O$76,14,15))))","v":12},{"$f":"IF($F$34<'Basic data'!$O$73,11,IF($F$34<'Basic data'!$O$74,12,IF($F$34<'Basic data'!$O$75,13,IF($F$34<'Basic data'!$O$76,14,15))))","v":12},16,16]
["Glulam \n(GL8)",{"$f":"IF('Basic data'!T5=1,VLOOKUP(INDEX(Calc!$AO$14:$BA$27,Results!I13,8),Glulam!D5:E11,2),IF('Basic data'!$T$5=6,\"NA\",VLOOKUP(INDEX(Calc!$U$1:$AE$126,'Basic data'!$T$5*14,8),Glulam!D5:E11,2)))","v":"225x65"},8,"135x65",{"$f":"IF(D13=\"\",\"\",D13&IF(MATCH(D13,Combined!B$5:B$109,0)<22,\"  VSG/MSG8\",IF(AND(MATCH(D13,Combined!B$5:B$109,0)>21,MATCH(D13,Combined!B$5:B$109,0)<48),\"  LVL\",IF(AND(MATCH(D13,Combined!B$5:B$109,0)>47,MATCH(D13,Combined!B$5:B$109,0)<62),\"  Glulam\",IF(AND(MATCH(D13,Combined!B$5:B$109,0)>90,MATCH(D13,Combined!B$5:B$109,0)<96),\"  Mitek flitch beam\",IF(MATCH(D13,Combined!B$5:B$109,0)>95,\"  Pryda flitch beam\",\"\"))))))","v":"135x65  Glulam"},null,null,null,1,{"$f":"MAX('Face loads'!F14,'Face loads'!I14)","v":0},null,"Concload",false,true,"  ",null,null,null,null,null,null,null,null,null,null,null,"Deck beam/bearer",6,16,16,16,16,{"$f":"IF($F$34<'Basic data'!$O$71,9,IF($F$34<'Basic data'!$O$72,10,15))","v":9},17]
[null,{"$f":"IF('Basic data'!T5=1,VLOOKUP(INDEX(Calc!$AO$14:$BA$27,Results!I14,9),Glulam!D12:E20,2),IF('Basic data'!$T$5=6,\"NA\",VLOOKUP(INDEX(Calc!$U$1:$AE$126,'Basic data'!$T$5*14,9),Glulam!D12:E20,2)))","v":"225x90"},9,"135x90",{"$f":"IF(D14=\"\",\"\",D14&IF(MATCH(D14,Combined!B$5:B$109,0)<22,\"  VSG/MSG8\",IF(AND(MATCH(D14,Combined!B$5:B$109,0)>21,MATCH(D14,Combined!B$5:B$109,0)<48),\"  LVL\",IF(AND(MATCH(D14,Combined!B$5:B$109,0)>47,MATCH(D14,Combined!B$5:B$109,0)<62),\"  Glulam\",IF(AND(MATCH(D14,Combined!B$5:B$109,0)>90,MATCH(D14,Combined!B$5:B$109,0)<96),\"  Mitek flitch beam\",IF(MATCH(D14,Combined!B$5:B$109,0)>95,\"  Pryda flitch beam\",\"\"))))))","v":"135x90  Glulam"},null,null,null,1,{"$f":"MAX('Face loads'!F15,'Face loads'!I15)","v":0},null,null,null,null,null,null,null,null,null,null,null,null,null,null,null,null,"Ridge/roof beam",7,{"$f":"IF($F$34<'Basic data'!$O$67,5,IF($F$34<'Basic data'!$O$68,6,IF($F$34<'Basic data'!$O$69,7,IF($F$34<'Basic data'!$O$70,8,15))))","v":6},{"$f":"IF($F$34<'Basic data'!$O$63,1,IF($F$34<'Basic data'!$O$64,2,IF($F$34<'Basic data'!$O$65,3,IF($F$34<'Basic data'!$O$66,4,15))))","v":2},{"$f":"IF($F$34<'Basic data'!$O$73,11,IF($F$34<'Basic data'!$O$74,12,IF($F$34<'Basic data'!$O$75,13,IF($F$34<'Basic data'!$O$76,14,15))))","v":12},{"$f":"IF($F$34<'Basic data'!$O$73,11,IF($F$34<'Basic data'!$O$74,12,IF($F$34<'Basic data'!$O$75,13,IF($F$34<'Basic data'!$O$76,14,15))))","v":12},16,16]
["Steel",{"$f":"IF('Basic data'!T5=1,VLOOKUP(INDEX(Calc!$AO$14:$BA$27,Results!I15,10),Steel!G4:H24,2),IF('Basic data'!$T$5=6,\"NA\",VLOOKUP(INDEX(Calc!$U$1:$AE$126,'Basic data'!$T$5*14,10),Steel!G4:H24,2)))","v":"150UB14"},10,"150UB14",{"$f":"IF(D15=\"\",\"\",D15&IF(MATCH(D15,Combined!B$5:B$109,0)<22,\"  VSG/MSG8\",IF(AND(MATCH(D15,Combined!B$5:B$109,0)>21,MATCH(D15,Combined!B$5:B$109,0)<48),\"  LVL\",IF(AND(MATCH(D15,Combined!B$5:B$109,0)>47,MATCH(D15,Combined!B$5:B$109,0)<62),\"  Glulam\",IF(AND(MATCH(D15,Combined!B$5:B$109,0)>90,MATCH(D15,Combined!B$5:B$109,0)<96),\"  Mitek flitch beam\",IF(MATCH(D15,Combined!B$5:B$109,0)>95,\"  Pryda flitch beam\",\"\"))))))","v":"150UB14"},null,null,null,1,{"$f":"MAX('Face loads'!F16,'Face loads'!I16)","v":0},null,"Configuration",false,false,true,false,null,null,null,null,null,null,null,null,null,null,"Garage door lintel",8,16,16,{"$f":"IF($F$34<'Basic data'!$O$73,11,IF($F$34<'Basic data'!$O$74,12,IF($F$34<'Basic data'!$O$75,13,IF($F$34<'Basic data'!$O$76,14,15))))","v":12},16,16,16]
[null,{"$f":"IF('Basic data'!T5=1,VLOOKUP(INDEX(Calc!$AO$14:$BA$27,Results!I16,11),Steel!G26:H35,2),IF('Basic data'!$T$5=6,\"NA\",VLOOKUP(INDEX(Calc!$U$1:$AE$126,'Basic data'!$T$5*14,11),Steel!G26:H35,2)))","v":"100PFC"},11,"100PFC",null,null,null,null,1,{"$f":"MAX('Face loads'!F17,'Face loads'!I17)","v":0},null,null,null,null,null,null,null,null,null,null,null,null,null,null,null,null,"Cantilever lintel",9,{"$f":"IF($F$34<'Basic data'!$O$67,5,IF($F$34<'Basic data'!$O$68,6,IF($F$34<'Basic data'!$O$69,7,IF($F$34<'Basic data'!$O$70,8,15))))","v":6},{"$f":"IF($F$34<'Basic data'!$O$63,1,IF($F$34<'Basic data'!$O$64,2,IF($F$34<'Basic data'!$O$65,3,IF($F$34<'Basic data'!$O$66,4,15))))","v":2},{"$f":"IF($F$34<'Basic data'!$O$73,11,IF($F$34<'Basic data'!$O$74,12,IF($F$34<'Basic data'!$O$75,13,IF($F$34<'Basic data'!$O$76,14,15))))","v":12},{"$f":"IF($F$34<'Basic data'!$O$73,11,IF($F$34<'Basic data'!$O$74,12,IF($F$34<'Basic data'!$O$75,13,IF($F$34<'Basic data'!$O$76,14,15))))","v":12},16,16]
["Flitch",{"$f":"IF('Basic data'!T5=1,VLOOKUP(INDEX(Calc!$AO$14:$BA$27,Results!I17,12),Flitch!F5:G10,2),IF(OR('Basic data'!T5=4,'Basic data'!T5=6),\"NA\",VLOOKUP(INDEX(Calc!$U$1:$AG$126,'Basic data'!$T$5*14,12),Flitch!F5:G10,2)))","v":"FB15L"},12,"FB15L",{"$f":"IF(D17=\"\",\"\",D17&IF(MATCH(D17,Combined!B$5:B$109,0)<22,\"  VSG/MSG8\",IF(AND(MATCH(D17,Combined!B$5:B$109,0)>21,MATCH(D17,Combined!B$5:B$109,0)<48),\"  LVL\",IF(AND(MATCH(D17,Combined!B$5:B$109,0)>47,MATCH(D17,Combined!B$5:B$109,0)<62),\"  Glulam\",IF(AND(MATCH(D17,Combined!B$5:B$109,0)>90,MATCH(D17,Combined!B$5:B$109,0)<96),\"  Mitek flitch beam\",IF(MATCH(D17,Combined!B$5:B$109,0)>95,\"  Pryda flitch beam\",\"\"))))))","v":"FB15L  Mitek flitch beam"},null,null,null,1,{"$f":"MAX('Face loads'!F18,'Face loads'!I18)","v":0},null,null,null,null,null,null,null,null,null,null,null,null,null,null,null,null,null,null,null,null,"Now allows up to 3 straps for all lintel applications"]
[null,{"$f":"IF('Basic data'!T5=1,VLOOKUP(INDEX(Calc!$AO$14:$BA$27,Results!I18,13),Flitch!F44:G54,2),IF(OR('Basic data'!T5=4,'Basic data'!T5=6),\"NA\",VLOOKUP(INDEX(Calc!$U$1:$AG$126,'Basic data'!$T$5*14,13),Flitch!F44:G54,2)))","v":"150PF6"},13,"150PF6",{"$f":"IF(D18=\"\",\"\",D18&IF(MATCH(D18,Combined!B$5:B$109,0)<22,\"  VSG/MSG8\",IF(AND(MATCH(D18,Combined!B$5:B$109,0)>21,MATCH(D18,Combined!B$5:B$109,0)<48),\"  LVL\",IF(AND(MATCH(D18,Combined!B$5:B$109,0)>47,MATCH(D18,Combined!B$5:B$109,0)<62),\"  Glulam\",IF(AND(MATCH(D18,Combined!B$5:B$109,0)>90,MATCH(D18,Combined!B$5:B$109,0)<96),\"  Mitek flitch beam\",IF(MATCH(D18,Combined!B$5:B$109,0)>95,\"  Pryda flitch beam\",\"\"))))))","v":"150PF6  Pryda flitch beam"},null,null,null,1,{"$f":"MAX('Face loads'!F19,'Face loads'!I19)","v":0}]
[null,null,null,null,null,null,null,null,null,{"$f":"SUM(J6:J18)","v":1}]
[null,"Chosen option:",1,{"$f":"VLOOKUP(C20,C6:D18,2)","v":"140x45"},null,"Width",{"$f":"VLOOKUP($D$20,Combined!$B$5:$G$109,6,FALSE)","v":45},"mm",null,"=IF(OR(Results!AB4=1,Results!AB4=5),IF(Results!AC32>Results!AC28,Results!AD32,Results!AD28),IF(Results!AB5=2,\"Min. of  \"&MAX(Results!AC33,Results!AC29)&\" m of foundation wall, at least 165mm wide\",IF(Results!AB5=3,\"Min. of  \"&MAX(Results!AC34,Results!AC29)&\" lineal metres of slab edging\",IF(Results!AB5=4,Results!AD35,Results!AD36))))"]
[null,"Application:",{"$f":"'Basic data'!T5","v":1},{"$f":"VLOOKUP(C21,'Basic data'!A7:B15,2)","v":"Lintel, roof only"}]
[]
[]
["B"]
[null,"Applied ","EI ","Defl ","Reaction (kN)",null,"Bearing area",null,"Beam support for given application",null,null,null,null,null,null,null,null,null,"Beam fixing for given application",null,null,null,null,null,null,null,null,"Foundation for given application",null,null,null,null,"Conc load"]
["Load case","UDL (kN/m)","(kNm2)","(mm)","Down","Up","Para.","Perp.","Criterion",1,2,3,4,5,6,7,8,9,1,2,3,4,5,6,7,8,9,1,2,3,4,5,"kN"]
["G+Ql",{"$f":"INDEX(Calc!$O$1:$O$125,5+VLOOKUP('Basic data'!$B$5,'Basic data'!$A$7:$D$15,4))","v":2.2879603587062833},{"$f":"VLOOKUP(D$20,Combined!$B$5:$F$109,IF('Basic data'!T$5=6,4,5),FALSE)","v":27.782999999999998},{"$f":"IF('Basic data'!T$5=9,(B27*Span^3/8+Calc!P117*Span^3/3+Calc!Q117*Span*BSpan/3)/C27*1000,0.013*B27*'Input beam data'!E$15^4/C27*1000)","v":86.715698726477214},{"$f":"B27*'Input beam data'!$E$15/2","v":3.431940538059425},null,null,null,null,null,null,null,null,null,null,null,null,null,null,null,null,null,null,null,null,null,null,"Bearing area:",{"$f":"MAX(MAX(E31:E35)/300,MAX(E27:E30)/100)","v":4.1144405380594246E-2},"m2",null,null,{"$f":"INDEX(Calc!$P$1:$P$111,5+VLOOKUP('Basic data'!$B$5,'Basic data'!$A$7:$D$14,4))","v":0}]
["G+Qs",{"$f":"INDEX(Calc!$O$1:$O$125,6+VLOOKUP('Basic data'!$B$5,'Basic data'!$A$7:$D$15,4))","v":2.7429603587062834},{"$f":"VLOOKUP(D20,Combined!$B$5:$F$109,IF('Basic data'!T$5=6,2,3),FALSE)","v":55.565999999999995},{"$f":"IF('Basic data'!T$5=9,(B28*Span^3/8+Calc!P118*Span^3/3+Calc!Q118*Span*BSpan/3)/C28*1000,0.013*B28*'Input beam data'!E$15^4/C28*1000)","v":51.980298342830437},{"$f":"B28*'Input beam data'!$E$15/2","v":4.1144405380594247},null,null,null,null,null,null,null,null,null,null,null,null,null,null,null,null,null,null,null,null,null,null,"Equiv",{"$f":"CEILING(AC27^0.5*1000,100)","v":300},{"$f":"AC28&\" x \"&AC28&\" x 200 thick (mm)\"","v":"300 x 300 x 200 thick (mm)"},null,"(for isolated pad or slab thickening)",{"$f":"INDEX(Calc!$P$1:$P$111,6+VLOOKUP('Basic data'!$B$5,'Basic data'!$A$7:$D$14,4))","v":0}]
["Spare",null,null,null,{"$f":"B29*'Input beam data'!$E$15/2","v":0},null,null,null,null,null,null,null,null,null,null,null,null,null,null,null,null,null,null,null,null,null,null,null,{"$f":"CEILING(AC27/0.165,0.1)","v":0.30000000000000004},"m",null,"(for foundation wall)"]
["G+S",{"$f":"INDEX(Calc!$O$1:$O$125,8+VLOOKUP('Basic data'!$B$5,'Basic data'!$A$7:$D$15,4))","v":2.2879603587062833},{"$f":"VLOOKUP(D20,Combined!$B$5:$F$109,IF('Basic data'!T$5=6,4,5),FALSE)","v":27.782999999999998},{"$f":"IF('Basic data'!T$5=9,(B30*Span^3/8+Calc!P120*Span^3/3+Calc!Q120*Span*BSpan/3)/C30*1000,0.013*B30*'Input beam data'!E$15^4/C30*1000)","v":86.715698726477214},{"$f":"B30*'Input beam data'!$E$15/2","v":3.431940538059425},null,null,null,"End 1",1,null,null,null,null,null,null,null,null,"End 1",null,null,null,null,null,null,null,null,null,{"$f":"CEILING(AC27/0.24,0.1)","v":0.2},"m",null,"(for slab edge)",{"$f":"INDEX(Calc!$P$1:$P$111,8+VLOOKUP('Basic data'!$B$5,'Basic data'!$A$7:$D$14,4))","v":0}]
["1.35G",{"$f":"INDEX(Calc!$O$1:$O$125,9+VLOOKUP('Basic data'!$B$5,'Basic data'!$A$7:$D$15,4))","v":3.0887464842534826},null,null,{"$f":"IF('Basic data'!$T$5=9,Calc!S121,B31*'Input beam data'!$E$15/2)","v":4.6331197263802242},null,{"$f":"INDEX(Calc!$AI$1:$AI$111,10+VLOOKUP('Basic data'!$B$5,'Basic data'!$A$7:$D$14,4))","v":0},{"$f":"E31*1000/IF('Basic data'!T5=6,'Basic data'!$L$21,'Basic data'!$J$21)","v":520.57525015508133},"i",{"$f":"IF(OR(MID($D$20,4,1)=\"U\",MID($D$20,4,1)=\"P\"),\"\",\nIF(MAX($H$31:$H$35)<15*VLOOKUP($D$20,Combined!$B$5:$G$109,6,FALSE),1,\nIF(MAX($H$31:$H$35)<45*VLOOKUP($D$20,Combined!$B$5:$G$109,6,FALSE),2,\nIF(MAX($H$31:$H$35)<90*VLOOKUP($D$20,Combined!$B$5:$G$109,6,FALSE),3,9))))","v":2},{"$f":"IF(OR(MID($D$20,4,1)=\"U\",MID($D$20,4,1)=\"P\"),\"\",                                     IF(MAX($H$31:$H$35)<15*VLOOKUP($D$20,Combined!$B$5:$G$109,6,FALSE),1,                                                                                                                                                                                                                                                 IF(MAX($H$31:$H$35)<45*VLOOKUP($D$20,Combined!$B$5:$G$109,6,FALSE),2,                                                                                                                                                                                                                                                  IF(MAX($H$31:$H$35)<90*VLOOKUP($D$20,Combined!$B$5:$G$109,6,FALSE),3,9))))","v":2},{"$f":"IF(OR(MID($D$20,4,1)=\"U\",MID($D$20,4,1)=\"P\"),\"\",IF(MAX($H$31:$H$35)<15*VLOOKUP($D$20,Combined!$B$5:$G$109,6,FALSE),1,IF(MAX($H$31:$H$35)<45*VLOOKUP($D$20,Combined!$B$5:$G$109,6,FALSE),2,IF(MAX($H$31:$H$35)<90*VLOOKUP($D$20,Combined!$B$5:$G$109,6,FALSE),3,9))))","v":2},{"$f":"IF(OR(MID($D$20,4,1)=\"U\",MID($D$20,4,1)=\"P\"),\"\",\nIF(J30=2,\nIF(MAX($H$31:$H$35)<15*90,4,10),\nIF(MAX($H$31:$H$35)>VLOOKUP($D$20,Combined!$B$5:$G$109,6,FALSE)*90,9,5)))","v":5},{"$f":"IF(OR(MID($D$20,4,1)=\"U\",MID($D$20,4,1)=\"P\"),\"\",IF(MAX(H$31:H$35)>VLOOKUP($D$20,Combined!$B$5:$G$109,6,FALSE)*90,9,5))","v":5},{"$f":"IF(OR(MID($D$20,4,1)=\"U\",MID($D$20,4,1)=\"P\"),\"\",\nIF(J30=2,IF(MAX($H$31:$H$35)<VLOOKUP($D$20,Combined!$B$5:$G$109,6,FALSE)*90,4,9),\nIF(MAX($H$31:$H$35)<VLOOKUP($D$20,Combined!$B$5:$G$109,6,FALSE)*125,8,9)))","v":8},{"$f":"IF(OR(MID($D$20,4,1)=\"U\",MID($D$20,4,1)=\"P\"),\"\",IF(MAX(H$31:H$35)>VLOOKUP($D$20,Combined!$B$5:$G$109,6,FALSE)*90,9,5))","v":5},{"$f":"IF(OR(MID($D$20,4,1)=\"U\",MID($D$20,4,1)=\"P\"),\"\",IF(MAX($H$31:$H$35)<15*VLOOKUP($D$20,Combined!$B$5:$G$109,6,FALSE),1,IF(MAX($H$31:$H$35)<45*VLOOKUP($D$20,Combined!$B$5:$G$109,6,FALSE),2,IF(MAX($H$31:$H$35)<90*VLOOKUP($D$20,Combined!$B$5:$G$109,6,FALSE),3,9))))","v":2},{"$f":"IF(OR(MID($D$20,4,1)=\"U\",MID($D$20,4,1)=\"P\"),\"\",IF(MAX($H$31:$H$35)<15*VLOOKUP($D$20,Combined!$B$5:$G$109,6,FALSE),1,IF(MAX($H$31:$H$35)<45*VLOOKUP($D$20,Combined!$B$5:$G$109,6,FALSE),2,IF(MAX($H$31:$H$35)<90*VLOOKUP($D$20,Combined!$B$5:$G$109,6,FALSE),3,9))))","v":2},null,null,null,null,null,null,null,null,null,"Vol conc:",{"$f":"F34/24","v":0.15657990918067971},"m3",null,null,{"$f":"INDEX(Calc!$P$1:$P$111,9+VLOOKUP('Basic data'!$B$5,'Basic data'!$A$7:$D$14,4))","v":0}]
["1.2G+1.5Q",{"$f":"INDEX(Calc!$O$1:$O$125,10+VLOOKUP('Basic data'!$B$5,'Basic data'!$A$7:$D$15,4))","v":3.7205524304475399},null,null,{"$f":"IF('Basic data'!$T$5=9,Calc!S122,B32*'Input beam data'!$E$15/2)","v":5.5808286456713097},null,{"$f":"INDEX(Calc!$AI$1:$AI$111,10+VLOOKUP('Basic data'!$B$5,'Basic data'!$A$7:$D$14,4))","v":0},{"$f":"E32*1000/IF('Basic data'!T5=6,'Basic data'!$L$21,'Basic data'!$J$21)","v":627.05939839003474},"ii",{"$f":"IF(VLOOKUP($D$20,Combined!$B$5:$G$109,6,FALSE)>90,\"Note: Your chosen lintel is wider than a 90mm wall\",\"\")","v":""},{"$f":"IF(VLOOKUP($D$20,Combined!$B$5:$G$109,6,FALSE)>90,\"Note: Your chosen lintel is wider than a 90mm wall\",\"\")","v":""},{"$f":"IF(VLOOKUP($D$20,Combined!$B$5:$G$109,6,FALSE)>90,\"Note: Your chosen lintel is wider than a 90mm wall\",\"\")","v":""},{"$f":"IF(J30=2,\"\",IF(VLOOKUP($D$20,Combined!$B$5:$G$109,6,FALSE)<=45,5,IF(VLOOKUP($D$20,Combined!$B$5:$G$109,6,FALSE)<=90,6,IF(VLOOKUP($D$20,Combined!$B$5:$G$109,6,FALSE)<=135,7,9))))","v":5},{"$f":"IF(J30=2,\"\",IF(VLOOKUP($D$20,Combined!$B$5:$G$109,6,FALSE)<=45,5,IF(VLOOKUP($D$20,Combined!$B$5:$G$109,6,FALSE)<=90,6,IF(VLOOKUP($D$20,Combined!$B$5:$G$109,6,FALSE)<=135,7,9))))","v":5},null,{"$f":"IF(J30=2,\"\",IF(VLOOKUP($D$20,Combined!$B$5:$G$109,6,FALSE)<=45,5,IF(VLOOKUP($D$20,Combined!$B$5:$G$109,6,FALSE)<=90,6,IF(VLOOKUP($D$20,Combined!$B$5:$G$109,6,FALSE)<=135,7,9))))","v":5},{"$f":"IF(VLOOKUP($D$20,Combined!$B$5:$G$109,6,FALSE)>90,\"Note: Your chosen lintel is wider than a 90mm wall\",\"\")","v":""},{"$f":"IF(VLOOKUP($D$20,Combined!$B$5:$G$109,6,FALSE)>90,\"Note: Your chosen lintel is wider than a 90mm wall\",\"\")","v":""},null,null,null,null,null,null,null,null,null,"Equiv",{"$f":"CEILING(AC31^0.333*1000,50)","v":550},{"$f":"AC32&\" x \"&AC32&\" x \"&AC32&\" (mm)\"","v":"550 x 550 x 550 (mm)"},null,"(for isolated pad)",{"$f":"INDEX(Calc!$P$1:$P$111,10+VLOOKUP('Basic data'!$B$5,'Basic data'!$A$7:$D$14,4))","v":0}]
["1.2G+yQ+W",{"$f":"INDEX(Calc!$O$1:$O$125,11+VLOOKUP('Basic data'!$B$5,'Basic data'!$A$7:$D$15,4))","v":4.2535524304475407},null,null,{"$f":"IF('Basic data'!$T$5=9,Calc!S123,B33*'Input beam data'!$E$15/2)","v":6.3803286456713106},null,{"$f":"INDEX(Calc!$AI$1:$AI$111,11+VLOOKUP('Basic data'!$B$5,'Basic data'!$A$7:$D$14,4))","v":0},{"$f":"E33*1000/IF('Basic data'!T5=6,'Basic data'!$L$21,'Basic data'!$J$21)","v":716.89085906419211},"iii",{"$f":"IF(MAX($E$31:$E$35)<'Basic data'!C30,1,IF(MAX($E$31:$E$35)<'Basic data'!C31,2,IF(MAX($E$31:$E$35)<'Basic data'!C32,3,9)))","v":2},{"$f":"IF(MAX($E$31:$E$35)<'Basic data'!C30,1,IF(MAX($E$31:$E$35)<'Basic data'!C31,2,IF(MAX($E$31:$E$35)<'Basic data'!C32,3,9)))","v":2},{"$f":"IF(MAX($E$31:$E$35)<'Basic data'!C30,1,IF(MAX($E$31:$E$35)<'Basic data'!C31,2,IF(MAX($E$31:$E$35)<'Basic data'!C32,3,9)))","v":2},{"$f":"IF(J30=2,IF(MAX(E$31:E$35)<'Basic data'!$C$33,4,9),IF(MAX(E$31:E$35)<'Basic data'!$C$34,5,IF(MAX(E$31:E$35)<'Basic data'!$C$35,6,IF(MAX(E$31:E$35)<'Basic data'!$C$36,7,9))))","v":5},{"$f":"IF(J30=2,IF(MAX($E$31:$E$35)<'Basic data'!C33,4,9),IF(MAX($E$31:$E$35)<'Basic data'!C34,5,IF(MAX($E$31:$E$35)<'Basic data'!C35,6,IF(MAX($E$31:$E$35)<'Basic data'!C36,7,9))))","v":5},{"$f":"IF(J30=2,IF(MAX($E$31:$E$35)<'Basic data'!C33,4,9),IF(MAX($E$31:$E$35)<'Basic data'!C37,8,9))","v":8},{"$f":"IF(J30=2,IF(MAX($E$31:$E$35)<'Basic data'!C33,4,9),IF(MAX($E$31:$E$35)<'Basic data'!C34,5,IF(MAX($E$31:$E$35)<'Basic data'!C35,6,IF(MAX($E$31:$E$35)<'Basic data'!C36,7,9))))","v":5},{"$f":"IF(MAX($E$31:$E$35)<'Basic data'!C30,1,IF(MAX($E$31:$E$35)<'Basic data'!C31,2,IF(MAX($E$31:$E$35)<'Basic data'!C32,3,9)))","v":2},{"$f":"IF(MAX($E$31:$E$35)<'Basic data'!C34,5,IF(MAX($E$31:$E$35)<'Basic data'!C35,6,IF(MAX($E$31:$E$35)<'Basic data'!C36,7,9)))","v":5},null,null,null,null,null,{"$f":"IF(AND(OR(MID($D$20,4,1)=\"U\",MID($D$20,4,3)=\"PFC\"),$F34<'Basic data'!$O38),9,IF($F34<'Basic data'!$O34,5,IF($F34<'Basic data'!$O35,6,IF($F34<'Basic data'!$O36,7,IF($F34<'Basic data'!$O37,8,16)))))","v":5},null,null,null,null,{"$f":"CEILING(AC31/0.07,0.1)","v":2.3000000000000003},"m",null,"(for foundation wall)",{"$f":"INDEX(Calc!$P$1:$P$111,11+VLOOKUP('Basic data'!$B$5,'Basic data'!$A$7:$D$14,4))","v":0}]
[".9G+W",{"$f":"INDEX(Calc!$O$1:$O$125,12+VLOOKUP('Basic data'!$B$5,'Basic data'!$A$7:$D$15,4))","v":-2.5052785468908754},null,null,null,{"$f":" ABS(IF('Basic data'!$T$5=9,Calc!S124,B34*'Input beam data'!$E$15/2))","v":3.7579178203363131},null,null,"iv",null,null,null,null,null,null,null,null,null,{"$f":"IF(AND(OR(MID($D$20,4,1)=\"U\",MID($D$20,4,3)=\"PFC\"),$F34<'Basic data'!$O33),4,IF($F34<'Basic data'!$O30,1,IF($F34<'Basic data'!$O31,2,IF($F34<'Basic data'!$O32,3,16))))","v":2},{"$f":"IF(AND(OR(MID($D$20,4,1)=\"U\",MID($D$20,4,3)=\"PFC\"),$F34<'Basic data'!$O33),4,IF($F34<'Basic data'!$O30,1,IF($F34<'Basic data'!$O31,2,IF($F34<'Basic data'!$O32,3,16))))","v":2},{"$f":"IF(AND(OR(MID($D$20,4,1)=\"U\",MID($D$20,4,3)=\"PFC\"),$F34<'Basic data'!$O33),4,IF($F34<'Basic data'!$O30,1,IF($F34<'Basic data'!$O31,2,IF($F34<'Basic data'!$O32,3,16))))","v":2},{"$f":"IF(J30=2,IF(AND(OR(MID($D$20,4,1)=\"U\",MID($D$20,4,3)=\"PFC\"),$F34<'Basic data'!$O38),9,IF($F34<'Basic data'!$O34,5,IF($F34<'Basic data'!$O35,6,IF($F34<'Basic data'!$O36,7,IF($F34<'Basic data'!$O37,8,16))))),IF(AND(OR(MID($D$20,4,1)=\"U\",MID($D$20,4,3)=\"PFC\"),$F34<'Basic data'!$O44),15,IF($F34<'Basic data'!$O39,10,IF($F34<'Basic data'!$O40,11,IF($F34<'Basic data'!$O41,12,IF($F34<'Basic data'!O42,13,IF($F34<'Basic data'!O43,14,16)))))))","v":12},{"$f":"IF(OR(MID($D$20,4,1)=\"U\",MID($D$20,4,3)=\"PFC\"),17,18)","v":18},{"$f":"IF(J30=4,19,7)","v":7},{"$f":"IF(J30=2,IF(AND(OR(MID($D$20,4,1)=\"U\",MID($D$20,4,3)=\"PFC\"),$F34<'Basic data'!$O38),9,IF($F34<'Basic data'!$O34,5,IF($F34<'Basic data'!$O35,6,IF($F34<'Basic data'!$O36,7,IF($F34<'Basic data'!$O37,8,16))))),IF(AND(OR(MID($D$20,4,1)=\"U\",MID($D$20,4,3)=\"PFC\"),$F34<'Basic data'!$O44),15,IF($F34<'Basic data'!$O39,10,IF($F34<'Basic data'!$O40,11,IF($F34<'Basic data'!$O41,12,IF($F34<'Basic data'!O42,13,IF($F34<'Basic data'!O43,14,16)))))))","v":12},{"$f":"IF(AND(OR(MID($D$20,4,1)=\"U\",MID($D$20,4,3)=\"PFC\"),$F34<'Basic data'!$O33),4,IF($F34<'Basic data'!$O30,1,IF($F34<'Basic data'!$O31,2,IF($F34<'Basic data'!$O32,3,16))))","v":2},{"$f":"IF(AND(OR(MID($D$20,4,1)=\"U\",MID($D$20,4,3)=\"PFC\"),$F34<'Basic data'!$O33),4,IF($F34<'Basic data'!$O49,20,IF($F34<'Basic data'!$O50,21,16)))","v":20},null,{"$f":"CEILING(AC31/0.15,0.1)","v":1.1000000000000001},"m",null,"(for slab edge)",{"$f":"INDEX(Calc!$P$1:$P$111,12+VLOOKUP('Basic data'!$B$5,'Basic data'!$A$7:$D$14,4))","v":0}]
["1.2G+yQ+S",{"$f":"INDEX(Calc!$O$1:$O$125,13+VLOOKUP('Basic data'!$B$5,'Basic data'!$A$7:$D$15,4))","v":2.7455524304475403},null,null,{"$f":"IF('Basic data'!$T$5=9,Calc!S125,B35*'Input beam data'!$E$15/2)","v":4.1183286456713102},null,{"$f":"INDEX(Calc!$AI$1:$AI$111,13+VLOOKUP('Basic data'!$B$5,'Basic data'!$A$7:$D$14,4))","v":0},{"$f":"E35*1000/IF('Basic data'!T5=6,'Basic data'!$L$21,'Basic data'!$J$21)","v":462.73355569340566},"v",null,null,null,null,null,{"$f":"IF('Input beam data'!E22=\">3m\",9,\"\")","v":""},null,null,null,null,null,null,null,null,null,null,null,null,null,{"$f":"IF(AC31>0.4,CEILING(1000*((AC31-0.4)/0.2)^0.5,50),0)","v":0},{"$f":"MAX(AC35,AC28,400)&\" x \"&MAX(AC35,AC28,400)&\", x 300 o.a. thickness (mm)\"","v":"400 x 400, x 300 o.a. thickness (mm)"},null,"(for slab thickening)",{"$f":"INDEX(Calc!$P$1:$P$111,13+VLOOKUP('Basic data'!$B$5,'Basic data'!$A$7:$D$14,4))","v":0}]
[null,null,null,null,null,null,null,null,null,{"$f":"IF(OR(MID($D$20,4,1)=\"U\",MID($D$20,4,1)=\"P\"),MAX(2,MAX(J31:J34)),MAX(J31:J34))","v":2},{"$f":"IF(OR(MID($D$20,4,1)=\"U\",MID($D$20,4,1)=\"P\"),MAX(2,MAX(K31:K34)),MAX(K31:K34))","v":2},{"$f":"IF(OR(MID($D$20,4,1)=\"U\",MID($D$20,4,1)=\"P\"),MAX(2,MAX(L31:L34)),MAX(L31:L34))","v":2},{"$f":"MAX(M31:M34)","v":5},5,{"$f":"MAX(O31:O35)","v":8},5,{"$f":"IF(OR(MID($D$20,4,1)=\"U\",MID($D$20,4,1)=\"P\"),MAX(2,MAX(Q31:Q34)),MAX(Q31:Q34))","v":2},5,null,null,null,null,null,null,null,null,null,"Pile:",{"$f":"IF('Basic data'!T5=6,MAX(Results!AC28,200),ROUND(AC31,2))","v":0.16},{"$f":"IF('Basic data'!T5=6,AC36&\" x \"&AC36&\" x 200 thick (mm)\",AC36&\" m3 of concrete\")","v":"0.16 m3 of concrete"}]
[null,null,null,null,null,null,null,null,"Support required:",null,null,null,null,null,null,null,null,null,"Fixing required:",null,null,null,null,null,null,null,null,"Fixing to found (end 1):"]
["Max M",{"$f":"MAX(ABS(INDEX(Calc!$Q$1:$Q$125,9+VLOOKUP('Basic data'!$B$5,'Basic data'!$A$7:$D$15,4))),ABS(INDEX(Calc!$Q$1:$Q$125,10+VLOOKUP('Basic data'!$B$5,'Basic data'!$A$7:$D$15,4))),ABS(INDEX(Calc!$Q$1:$Q$125,11+VLOOKUP('Basic data'!$B$5,'Basic data'!$A$7:$D$15,4))),ABS(INDEX(Calc!$Q$1:$Q$125,12+VLOOKUP('Basic data'!$B$5,'Basic data'!$A$7:$D$15,4))),ABS(INDEX(Calc!$Q$1:$Q$125,13+VLOOKUP('Basic data'!$B$5,'Basic data'!$A$7:$D$15,4))))","v":4.7852464842534834},"kNm",null,null,null,null,null,{"$f":"VLOOKUP(HLOOKUP('Basic data'!T5,Results!I26:R36,11),'Basic data'!D30:E39,2)","v":"Single prop stud (90x45)"},null,null,null,null,null,null,null,null,null,{"$f":"VLOOKUP(HLOOKUP('Basic data'!T5,Results!S26:AA36,9),'Basic data'!P30:Q50,2)","v":"25x0.9 mm nail strap with 6/30x3.15 nails (see Figure 8.12 NZS 3604)"},null,null,null,null,null,null,null,null,{"$f":"VLOOKUP(INDEX(AC8:AH16,'Basic data'!T5,AB4),'Basic data'!P63:Q79,2)","v":"25x0.9 mm nail strap folded under plate, with 6/30x3.15 nails each side of stud (see Figure 8.12 NZS 3604), 15kN bolt, plate to slab"}]
["Max V",{"$f":"MAX(ABS(INDEX(Calc!$R$1:$R$125,9+VLOOKUP('Basic data'!$B$5,'Basic data'!$A$7:$D$15,4))),ABS(INDEX(Calc!$R$1:$R$125,10+VLOOKUP('Basic data'!$B$5,'Basic data'!$A$7:$D$15,4))),ABS(INDEX(Calc!$R$1:$R$125,11+VLOOKUP('Basic data'!$B$5,'Basic data'!$A$7:$D$15,4))),ABS(INDEX(Calc!$R$1:$R$125,12+VLOOKUP('Basic data'!$B$5,'Basic data'!$A$7:$D$15,4))),ABS(INDEX(Calc!$R$1:$R$125,13+VLOOKUP('Basic data'!$B$5,'Basic data'!$A$7:$D$15,4))))","v":6.3803286456713106},"kN"]
[null,null,null,null,null,null,null,null,"End 2",1,null,null,null,null,null,null,null,null,"End 2"]
[null,null,null,null,null,null,null,null,"i",{"$f":"IF(OR(MID($D$20,4,1)=\"U\",MID($D$20,4,1)=\"P\"),\"\",IF(MAX($H$31:$H$35)<15*VLOOKUP($D$20,Combined!$B$5:$G$109,6,FALSE),1,IF(MAX($H$31:$H$35)<45*VLOOKUP($D$20,Combined!$B$5:$G$109,6,FALSE),2,IF(MAX($H$31:$H$35)<90*VLOOKUP($D$20,Combined!$B$5:$G$109,6,FALSE),3,9))))","v":2},{"$f":"IF(OR(MID($D$20,4,1)=\"U\",MID($D$20,4,1)=\"P\"),\"\",\nIF(MAX($H31:$H35)<15*VLOOKUP($D$20,Combined!$B$5:$G$109,6,FALSE),1,\nIF(MAX($H31:$H35)<45*VLOOKUP($D$20,Combined!$B$5:$G$109,6,FALSE),2,\nIF(MAX($H31:$H35)<90*VLOOKUP($D$20,Combined!$B$5:$G$109,6,FALSE),3,9))))","v":2},{"$f":"IF(OR(MID($D$20,4,1)=\"U\",MID($D$20,4,1)=\"P\"),\"\",IF(MAX($H$31:$H$35)<15*VLOOKUP($D$20,Combined!$B$5:$G$109,6,FALSE),1,IF(MAX($H$31:$H$35)<45*VLOOKUP($D$20,Combined!$B$5:$G$109,6,FALSE),2,IF(MAX($H$31:$H$35)<90*VLOOKUP($D$20,Combined!$B$5:$G$109,6,FALSE),3,9))))","v":2},{"$f":"IF(OR(MID($D$20,4,1)=\"U\",MID($D$20,4,1)=\"P\"),\"\",                                       IF(J40=2,                                                                                                                                                    IF(MAX($H$31:$H$35)<15*90,4,10),                                                                                IF(MAX(H$31:H$35)>VLOOKUP($D$20,Combined!$B$5:$G$109,6,FALSE)*90,9,5)))","v":5},{"$f":"IF(OR(MID($D$20,4,1)=\"U\",MID($D$20,4,1)=\"P\"),\"\",IF(MAX(H$31:H$35)>VLOOKUP($D$20,Combined!$B$5:$G$109,6,FALSE)*90,9,5))","v":5},{"$f":"IF(OR(MID($D$20,4,1)=\"U\",MID($D$20,4,1)=\"P\"),\"\",IF(J40=2,IF(MAX($H$31:$H$35)<90*90,4,9),IF(MAX($H$31:$H$35)<125*125,8,9)))","v":8},{"$f":"IF(OR(MID($D$20,4,1)=\"U\",MID($D$20,4,1)=\"P\"),\"\",IF(MAX(H$31:H$35)>VLOOKUP($D$20,Combined!$B$5:$G$109,6,FALSE)*90,9,5))","v":5},{"$f":"IF(OR(MID($D$20,4,1)=\"U\",MID($D$20,4,1)=\"P\"),\"\",IF(MAX($H$31:$H$35)<15*VLOOKUP($D$20,Combined!$B$5:$G$109,6,FALSE),1,IF(MAX($H$31:$H$35)<45*VLOOKUP($D$20,Combined!$B$5:$G$109,6,FALSE),2,IF(MAX($H$31:$H$35)<90*VLOOKUP($D$20,Combined!$B$5:$G$109,6,FALSE),3,9))))","v":2},{"$f":"IF(OR(MID($D$20,4,1)=\"U\",MID($D$20,4,1)=\"P\"),\"\",IF(MAX($H31:$H35)<15*VLOOKUP($D$20,Combined!$B$5:$G$109,6,FALSE),1,IF(MAX($H31:$H35)<45*VLOOKUP($D$20,Combined!$B$5:$G$109,6,FALSE),2,IF(MAX($H31:$H35)<90*VLOOKUP($D$20,Combined!$B$5:$G$109,6,FALSE),3,9))))","v":2}]
[null,null,null,null,null,null,null,null,"ii",{"$f":"IF(VLOOKUP($D$20,Combined!$B$5:$G$109,6,FALSE)>90,\"Note: Your chosen lintel is wider than a 90mm wall\",\"\")","v":""},{"$f":"IF(VLOOKUP($D$20,Combined!$B$5:$G$109,6,FALSE)>90,\"Note: Your chosen lintel is wider than a 90mm wall\",\"\")","v":""},{"$f":"IF(VLOOKUP($D$20,Combined!$B$5:$G$109,6,FALSE)>90,\"Note: Your chosen lintel is wider than a 90mm wall\",\"\")","v":""},{"$f":"IF(J40=2,\"\",IF(VLOOKUP($D$20,Combined!$B$5:$G$109,6,FALSE)<=45,5,IF(VLOOKUP($D$20,Combined!$B$5:$G$109,6,FALSE)<=90,6,IF(VLOOKUP($D$20,Combined!$B$5:$G$109,6,FALSE)<=135,7,9))))","v":5},{"$f":"IF(J40=2,\"\",IF(VLOOKUP($D$20,Combined!$B$5:$G$109,6,FALSE)<=45,5,IF(VLOOKUP($D$20,Combined!$B$5:$G$109,6,FALSE)<=90,6,IF(VLOOKUP($D$20,Combined!$B$5:$G$109,6,FALSE)<=135,7,9))))","v":5},null,{"$f":"IF(J40=2,\"\",IF(VLOOKUP($D$20,Combined!$B$5:$G$109,6,FALSE)<=45,5,IF(VLOOKUP($D$20,Combined!$B$5:$G$109,6,FALSE)<=90,6,IF(VLOOKUP($D$20,Combined!$B$5:$G$109,6,FALSE)<=135,7,9))))","v":5},{"$f":"IF(VLOOKUP($D$20,Combined!$B$5:$G$109,6,FALSE)>90,\"Note: Your chosen lintel is wider than a 90mm wall\",\"\")","v":""},{"$f":"IF(VLOOKUP($D$20,Combined!$B$5:$G$109,6,FALSE)>90,\"Note: Your chosen lintel is wider than a 90mm wall\",\"\")","v":""}]
[null,null,null,null,null,null,null,null,"iii",{"$f":"IF(MAX($E$31:$E$35)<'Basic data'!C30,1,IF(MAX($E$31:$E$35)<'Basic data'!C31,2,IF(MAX($E$31:$E$35)<'Basic data'!C32,3,9)))","v":2},{"$f":"IF(MAX($E$31:$E$35)<'Basic data'!C30,1,IF(MAX($E$31:$E$35)<'Basic data'!C31,2,IF(MAX($E$31:$E$35)<'Basic data'!C32,3,9)))","v":2},{"$f":"IF(MAX($E$31:$E$35)<'Basic data'!C30,1,IF(MAX($E$31:$E$35)<'Basic data'!C31,2,IF(MAX($E$31:$E$35)<'Basic data'!C32,3,9)))","v":2},{"$f":"IF(J40=2,IF(MAX(E$31:E$35)<'Basic data'!$C$33,4,9),IF(MAX(E$31:E$35)<'Basic data'!$C$34,5,IF(MAX(E$31:E$35)<'Basic data'!$C$35,6,IF(MAX(E$31:E$35)<'Basic data'!$C$36,7,9))))","v":5},{"$f":"IF(J40=2,IF(MAX($E$31:$E$35)<'Basic data'!C33,4,9),IF(MAX($E$31:$E$35)<'Basic data'!C34,5,IF(MAX($E$31:$E$35)<'Basic data'!C35,6,IF(MAX($E$31:$E$35)<'Basic data'!C36,7,9))))","v":5},{"$f":"IF(J40=2,IF(MAX($E$31:$E$35)<'Basic data'!C33,4,9),IF(MAX($E$31:$E$35)<'Basic data'!C37,8,9))","v":8},{"$f":"IF(J40=2,IF(MAX($E$31:$E$35)<'Basic data'!C33,4,9),IF(MAX($E$31:$E$35)<'Basic data'!C34,5,IF(MAX($E$31:$E$35)<'Basic data'!C35,6,IF(MAX($E$31:$E$35)<'Basic data'!C36,7,9))))","v":5},{"$f":"IF(MAX($E$31:$E$35)<'Basic data'!C30,1,IF(MAX($E$31:$E$35)<'Basic data'!C31,2,IF(MAX($E$31:$E$35)<'Basic data'!C32,3,9)))","v":2},{"$f":"IF(MAX($E$31:$E$35)<'Basic data'!C34,5,IF(MAX($E$31:$E$35)<'Basic data'!C35,6,IF(MAX($E$31:$E$35)<'Basic data'!C36,7,9)))","v":5},null,null,null,null,null,{"$f":"IF(AND(OR(MID($D$20,4,1)=\"U\",MID($D$20,4,3)=\"PFC\"),$F44<'Basic data'!$O48),9,IF($F44<'Basic data'!$O44,5,IF($F44<'Basic data'!$O45,6,IF($F44<'Basic data'!$O46,7,IF($F44<'Basic data'!$O47,8,16)))))","v":5}]
[null,null,null,null,null,null,null,null,"iv",null,null,null,null,null,null,null,null,null,{"$f":"IF(AND(OR(MID($D$20,4,1)=\"U\",MID($D$20,4,3)=\"PFC\"),$F34<'Basic data'!$O33),4,IF($F34<'Basic data'!$O30,1,IF($F34<'Basic data'!$O31,2,IF($F34<'Basic data'!$O32,3,16))))","v":2},{"$f":"IF(AND(OR(MID($D$20,4,1)=\"U\",MID($D$20,4,3)=\"PFC\"),$F34<'Basic data'!$O33),4,IF($F34<'Basic data'!$O30,1,IF($F34<'Basic data'!$O31,2,IF($F34<'Basic data'!$O32,3,16))))","v":2},{"$f":"IF(AND(OR(MID($D$20,4,1)=\"U\",MID($D$20,4,3)=\"PFC\"),$F34<'Basic data'!$O33),4,IF($F34<'Basic data'!$O30,1,IF($F34<'Basic data'!$O31,2,IF($F34<'Basic data'!$O32,3,16))))","v":2},{"$f":"IF(J40=2,IF(AND(OR(MID($D$20,4,1)=\"U\",MID($D$20,4,3)=\"PFC\"),$F34<'Basic data'!$O38),9,IF($F34<'Basic data'!$O34,5,IF($F34<'Basic data'!$O35,6,IF($F34<'Basic data'!$O36,7,IF($F34<'Basic data'!$O37,8,16))))),IF(AND(OR(MID($D$20,4,1)=\"U\",MID($D$20,4,3)=\"PFC\"),$F34<'Basic data'!$O44),15,IF($F34<'Basic data'!$O39,10,IF($F34<'Basic data'!$O40,11,IF($F34<'Basic data'!$O41,12,IF($F34<'Basic data'!O42,13,IF($F34<'Basic data'!O43,14,16)))))))","v":12},{"$f":"IF(OR(MID($D$20,4,1)=\"U\",MID($D$20,4,3)=\"PFC\"),17,18)","v":18},{"$f":"IF(J40=4,19,7)","v":7},{"$f":"IF(J40=2,IF(AND(OR(MID($D$20,4,1)=\"U\",MID($D$20,4,3)=\"PFC\"),$F34<'Basic data'!$O38),9,IF($F34<'Basic data'!$O34,5,IF($F34<'Basic data'!$O35,6,IF($F34<'Basic data'!$O36,7,IF($F34<'Basic data'!$O37,8,16))))),IF(AND(OR(MID($D$20,4,1)=\"U\",MID($D$20,4,3)=\"PFC\"),$F34<'Basic data'!$O44),15,IF($F34<'Basic data'!$O39,10,IF($F34<'Basic data'!$O40,11,IF($F34<'Basic data'!$O41,12,IF($F34<'Basic data'!O42,13,IF($F34<'Basic data'!O43,14,16)))))))","v":12},{"$f":"IF(AND(OR(MID($D$20,4,1)=\"U\",MID($D$20,4,3)=\"PFC\"),$F34<'Basic data'!$O33),4,IF($F34<'Basic data'!$O30,1,IF($F34<'Basic data'!$O31,2,IF($F34<'Basic data'!$O32,3,16))))","v":2},{"$f":"IF(AND(OR(MID($D$20,4,1)=\"U\",MID($D$20,4,3)=\"PFC\"),$F34<'Basic data'!$O43),4,IF($F34<'Basic data'!$O49,20,IF($F34<'Basic data'!$O50,21,16)))","v":20}]
[null,null,null,null,null,null,null,null,"v",null,null,null,null,null,{"$f":"IF('Input beam data'!E22=\">3m\",9,\"\")","v":""}]
[null,null,null,null,null,null,null,null,null,{"$f":"IF(OR(MID($D$20,4,1)=\"U\",MID($D$20,4,1)=\"P\"),MAX(2,MAX(J41:J44)),MAX(J41:J44))","v":2},{"$f":"IF(OR(MID($D$20,4,1)=\"U\",MID($D$20,4,1)=\"P\"),MAX(2,MAX(K41:K44)),MAX(K41:K44))","v":2},{"$f":"IF(OR(MID($D$20,4,1)=\"U\",MID($D$20,4,1)=\"P\"),MAX(2,MAX(L41:L44)),MAX(L41:L44))","v":2},{"$f":"MAX(M41:M44)","v":5},5,{"$f":"MAX(O41:O45)","v":8},{"$f":"MAX(P41:P44)","v":5},{"$f":"IF(OR(MID($D$20,4,1)=\"U\",MID($D$20,4,1)=\"P\"),MAX(2,MAX(Q41:Q44)),MAX(Q41:Q44))","v":2},{"$f":"MAX(R41:R44)","v":5}]
[null,null,null,null,null,null,null,null,"Support required:",null,null,null,null,null,null,null,null,null,"Fixing required:"]
[null,null,null,null,null,null,null,null,{"$f":"VLOOKUP(HLOOKUP('Basic data'!T5,Results!I26:R46,21),'Basic data'!D30:E39,2)","v":"Single prop stud (90x45)"},null,null,null,null,null,null,null,null,null,{"$f":"VLOOKUP(HLOOKUP('Basic data'!T5,Results!S26:AA44,19),'Basic data'!P30:Q50,2)","v":"25x0.9 mm nail strap with 6/30x3.15 nails (see Figure 8.12 NZS 3604)"}]
[]
[]
[null,null,null,null,null,null,null,null,null,null,null,null,null,null,null,null,null,null,null,null,null,null,null,null,null,null,null,"Fixing to found (end 2):"]
[null,null,null,null,null,null,null,null,null,null,null,null,null,null,null,null,null,null,null,null,null,null,null,null,null,null,null,{"$f":"VLOOKUP(INDEX(AC8:AH16,'Basic data'!T5,AB5),'Basic data'!P63:Q79,2)","v":"25x0.9 mm nail strap folded under plate, with 6/30x3.15 nails each side of stud (see Figure 8.12 NZS 3604), 15kN bolt, plate to slab"}]

{"sheet":"Face loads","index":12,"n_rows":21,"n_cols":9,"rows_kept":21,"cut":false,"hidden":true,"merged":[]}
["Bending about 2 axes",null,null,null,"LD",400,"mm"]
[null,null,null,null,"Deflection limit",100]
["ULS:","Mx*",{"$f":"MAX(Calc!Q11:Q12)","v":4.7852464842534834},"kNm",null,"SLS:","w",{"$f":"IF('Basic data'!T5=1,0.71*VLOOKUP('Basic data'!I$5,'Basic data'!$G$7:$Y$14,3)*'Basic data'!$H$20*(F1/2000),0.1)","v":0.16471999999999998},"kN/m"]
[null,"My*",{"$f":"IF('Basic data'!T5=1,VLOOKUP('Basic data'!I$5,'Basic data'!$G$7:$Y$14,3)*'Basic data'!$H$20*(F1/2000)*Span^2/8,0)","v":0.26100000000000001},"kNm"]
[null,null,null,null,null,"\"0\" = Means size is OK, \"1\" = size must be incremented (done in \"Results sheet\" by macro \"Selection\" in module 2)"]
["Calculated size",null,"fMx","fMy","Eqn result","What to do?","EIface","dface","What to do?"]
[{"$f":"Results!A6","v":"Timber \n(VSG/MSG8)"},{"$f":"Results!B6","v":"290x45"},{"$f":"INDEX(VSGMSG8!$I$5:$M$29,MATCH(B7,VSGMSG8!$I$5:$I$29,0),4)","v":4.9647556622222231},{"$f":"INDEX(VSGMSG8!$I$5:$M$29,MATCH(B7,VSGMSG8!$I$5:$I$29,0),3)","v":1.0962000000000001},{"$f":"IF(B7=\"X\",\"NA\",$C$3/C7+$C$4/D7)","v":1.2019385387163222},{"$f":"IF(E7=\"NA\",\"0\",IF(E7>=1,1,0))","v":1},{"$f":"INDEX(VSGMSG8!$I$5:$M$29,MATCH(B7,VSGMSG8!$I$5:$I$29,0),5)","v":11.8918125},{"$f":"IF(G7=0,\"NA\",0.013*$H$3*Span^4/G7*1000)","v":14.585679012345675},{"$f":"IF(H7=\"NA\",0,IF(Span*1000/H7<$F$2,1,0))","v":0}]
[null,{"$f":"Results!B7","v":"290x70"},{"$f":"INDEX(VSGMSG8!$I$5:$M$29,MATCH(B8,VSGMSG8!$I$5:$I$29,0),4)","v":10.989066666666668},{"$f":"INDEX(VSGMSG8!$I$5:$M$29,MATCH(B8,VSGMSG8!$I$5:$I$29,0),3)","v":2.6525333333333339},{"$f":"IF(B8=\"X\",\"NA\",$C$3/C8+$C$4/D8)","v":0.5338517252183258},{"$f":"IF(E8=\"NA\",\"0\",IF(E8>=1,1,0))","v":0},{"$f":"INDEX(VSGMSG8!$I$5:$M$29,MATCH(B8,VSGMSG8!$I$5:$I$29,0),5)","v":55.537416666666665},3.1231225795222137,0]
[null,{"$f":"Results!B8","v":"2/240x45"},{"$f":"INDEX(VSGMSG8!$I$5:$M$29,MATCH(B9,VSGMSG8!$I$5:$I$29,0),4)","v":11.031552},{"$f":"INDEX(VSGMSG8!$I$5:$M$29,MATCH(B9,VSGMSG8!$I$5:$I$29,0),3)","v":2.0684159999999996},0.559961688459927,0,{"$f":"INDEX(VSGMSG8!$I$5:$M$29,MATCH(B9,VSGMSG8!$I$5:$I$29,0),5)","v":24.421500000000002},7.1023548922056365,0]
[null,{"$f":"Results!B9","v":"240x90"},{"$f":"INDEX(VSGMSG8!$I$5:$M$29,MATCH(B10,VSGMSG8!$I$5:$I$29,0),4)","v":9.6768000000000018},{"$f":"INDEX(VSGMSG8!$I$5:$M$29,MATCH(B10,VSGMSG8!$I$5:$I$29,0),3)","v":3.6288},0.56643172166971334,0,{"$f":"INDEX(VSGMSG8!$I$5:$M$29,MATCH(B10,VSGMSG8!$I$5:$I$29,0),5)","v":97.686000000000007},1.7755887230514091,0]
[{"$f":"Results!A10","v":"LVL"},{"$f":"Results!B10","v":"240 x45"},{"$f":"INDEX(LVL!$F$5:$J$32,MATCH(B11,LVL!$F$5:$F$32,0),4)","v":10.879046283465657},{"$f":"INDEX(LVL!$F$5:$J$32,MATCH(B11,LVL!$F$5:$F$32,0),3)","v":2.7702000000000004},0.53407603002138937,0,{"$f":"INDEX(LVL!$F$5:$J$32,MATCH(B11,LVL!$F$5:$F$32,0),5)","v":20.047499999999999},8.6519595959595943,0]
[null,{"$f":"Results!B11","v":"200x63"},{"$f":"INDEX(LVL!$F$5:$J$32,MATCH(B12,LVL!$F$5:$F$32,0),4)","v":12.68478846665759},{"$f":"INDEX(LVL!$F$5:$J$32,MATCH(B12,LVL!$F$5:$F$32,0),3)","v":4.5246600000000008},0.43492679993347561,0,{"$f":"INDEX(LVL!$F$5:$J$32,MATCH(B12,LVL!$F$5:$F$32,0),5)","v":45.841949999999997},3.7836557999823297,0]
[null,{"$f":"Results!B12","v":"200x90"},{"$f":"INDEX(LVL!$F$5:$J$32,MATCH(B13,LVL!$F$5:$F$32,0),4)","v":16.371312282721142},{"$f":"INDEX(LVL!$F$5:$J$32,MATCH(B13,LVL!$F$5:$F$32,0),3)","v":8.2620000000000005},0.32388503282396863,0,{"$f":"INDEX(LVL!$F$5:$J$32,MATCH(B13,LVL!$F$5:$F$32,0),5)","v":115.425},1.5027087719298242,0]
[{"$f":"Results!A13","v":"Glulam \n(GL8)"},{"$f":"Results!B13","v":"225x65"},{"$f":"INDEX(Glulam!$E$5:$H$11,MATCH(B14,Glulam!$E$5:$E$11,0),3)","v":6.6690000000000005},{"$f":"INDEX(Glulam!$E$5:$H$11,MATCH(B14,Glulam!$E$5:$E$11,0),2)","v":2.4275160000000002},0.82505314909078575,0,{"$f":"INDEX(Glulam!$E$5:$H$11,MATCH(B14,Glulam!$E$5:$E$11,0),4)","v":41.193750000000001},4.2105940828402355,0]
[null,{"$f":"Results!B14","v":"225x90"},{"$f":"INDEX(Glulam!$E$12:$H$20,MATCH(B15,Glulam!$E$12:$E$20,0),3)","v":9.2340000000000018},{"$f":"INDEX(Glulam!$E$12:$H$20,MATCH(B15,Glulam!$E$12:$E$20,0),2)","v":4.6539360000000007},0.57430188727643772,0,{"$f":"INDEX(Glulam!$E$12:$H$20,MATCH(B15,Glulam!$E$12:$E$20,0),4)","v":109.35},1.5861925925925924,0]
[{"$f":"Results!A15","v":"Steel"},{"$f":"Results!B15","v":"150UB14"},{"$f":"INDEX(Steel!$H$4:$AH$24,MATCH(B16,Steel!$H$4:$H$24,0),25)","v":18.252209712984538},{"$f":"INDEX(Steel!$H$4:$AH$24,MATCH(B16,Steel!$H$4:$H$24,0),24)","v":5.9904000000000002},0.235107436794257,0,{"$f":"INDEX(Steel!$H$4:$AH$24,MATCH(B16,Steel!$H$4:$H$24,0),27)","v":103.95},1.6685922077922075,0]
[null,{"$f":"Results!B16","v":"100PFC"},{"$f":"INDEX(Steel!$H$26:$AH$35,MATCH(B17,Steel!$H$26:$H$35,0),25)","v":8.0664267188258396},{"$f":"INDEX(Steel!$H$26:$AH$35,MATCH(B17,Steel!$H$26:$H$35,0),24)","v":2.30688},0.70636984528243285,0,{"$f":"INDEX(Steel!$H$26:$AH$35,MATCH(B17,Steel!$H$26:$H$35,0),27)","v":56.07},3.0934574638844294,0]
[{"$f":"Results!A17","v":"Flitch"},{"$f":"Results!B17","v":"FB15L"},{"$f":"INDEX(Flitch!$G$5:$L$54,MATCH(B18,Flitch!$G$5:$G$54,0),5)","v":6.3722307692307689},{"$f":"INDEX(Flitch!$G$5:$L$54,MATCH(B18,Flitch!$G$5:$G$54,0),4)","v":1.0616666666666665},0.99679297977586911,0,{"$f":"INDEX(Flitch!$G$5:$L$54,MATCH(B18,Flitch!$G$5:$G$54,0),6)","v":12.998066666666666},13.344304537597896,0]
[null,{"$f":"Results!B18","v":"150PF6"},{"$f":"INDEX(Flitch!$G$5:$L$54,MATCH(B19,Flitch!$G$5:$G$54,0),5)","v":6.6629722222222236},{"$f":"INDEX(Flitch!$G$5:$L$54,MATCH(B19,Flitch!$G$5:$G$54,0),4)","v":1.0616666666666665},0.96402484121843102,0,{"$f":"INDEX(Flitch!$G$5:$L$54,MATCH(B19,Flitch!$G$5:$G$54,0),6)","v":13.016966666666665},13.32492925899275,0]
[]
[null,null,null,null,null,{"$f":"SUM(F7:F17,I7:I17)","v":1}]

{"sheet":"Schedule","index":13,"n_rows":12,"n_cols":16,"rows_kept":12,"cut":false,"hidden":true,"merged":[[4,15,5,17],[2,2,2,4],[3,2,3,4]]}
["Schedule of beams",null,null,null,null,null,null,null,null,null,null,null,null,"Produced by BRANZ Lintels and Beams",null,"To design a new beam, press button"]
[null,null,null,null,null,null,null,null,null,null,null,"Date:",null,{"$f":"LastModified()","v":"2020-07-16T13:16:57"}]
[null,"Project ref:",{"$f":"'Input beam data'!D7","v":"Project reference"},null,null,null,"Wind zone:",{"$f":"Print!C17","v":"High"},null,"Snow load:",{"$f":"Print!C18","v":0}]
[null,"Title:",{"$f":"'Input beam data'!D4","v":"BRANZ"}]
[1,2,3,4,5,6,7,8,9,10,11,12,13,14,null,"To alter beam details, select beam Id and press button"]
["Id","Beam ref","Opening","Application","Span\n(m)","Loaded dim. (m)","Roof \nweight","Roof slope\n(deg)","Roof o/h\n(m)","Wall \nweight","Wall\nheight (m)","Floor live load (kPa)","LD floor\n(m)","Selected beam"]
[1,"Check3 B1",null,"Lintel, roof wall and floor",3,5,"Heavy",15,0.6,"Light",2.4,1.5,3,"180PFC"]
[2,"Check3 B2",null,"Lintel, roof wall and floor",3.5,5,"Light",15,0.6,"Light",2.4,1.5,3,"250UB37"]
[3,"Check3 B3",null,"Lintel, roof wall and floor",3,5,"Light",15,0.6,"Light",2.4,1.5,3,"610x63  LVL"]
[4,"Check5 B3",null,"Floor beam",5,3.5,null,null,0,null,null,1.5,null,"150UB18",null,"Print the schedule for your record"]
[5,"Check5 B4",null,"Deck beam/bearer",4,4,null,null,0,null,null,null,null,"360x63  LVL"]
[6,"Check5 B7",null,"Ridge/roof beam",4,0.89999997615814209,"Light",5,0,null,null,null,null,"360x65  Glulam"]

{"sheet":"Clean-up","index":14,"n_rows":49,"n_cols":22,"rows_kept":49,"cut":false,"hidden":true,"merged":[[0,14,0,16],[21,14,21,15],[3,3,5,3],[3,4,5,4],[4,5,5,5],[4,6,5,6],[0,11,0,12]]}
["Notes for cleanup exercise",null,null,null,null,null,null,null,null,null,null,"Named cells",null,null,"Action for each sheet"]
[null,null,null,null,null,null,null,null,null,null,null,"Appplication","=Print!$C$23",null,"Sheet","Needed?","Visible?","Changes","Done?"]
[null,"Table of options","See also Range (AB5:AH16) in \"Results\"",null,null,null,null,null,null,null,null,"Beam","=Print!$C$46",null,"Combined","y","n","None"]
[null,null,null,"Isolated pad footing (timber floor)","Foundation wall with timber subfloor",null,null,null,null,null,null,"Beamref","=Front!$B$10",null,"VSGMSG8","y","n","None"]
[null,null,null,null,null,"Concrete slab edging","Local slab thickening",null,null,null,null,"BSpan","=Front!$O$23",null,"LVL","y","n","Remove note to Doug","Done"]
[null,null,null,null,null,null,null,"Pad footing","Pile footing",null,null,"ConcOp1","=Results!$M$13",null,"Glulam","y","n","None"]
[null,"Lintel, roof only",1,"y","y","y","y","n","n",null,null,"ConcOp2","=Results!$N$13",null,"Steel","y","n","None"]
[null,"Lintel, roof and wall",2,"y","y","y","y","n","n",null,null,"Config1","=Results!$M$15",null,"Flitch","y","n","None"]
[null,"Lintel, roof wall and floor",3,"y","y","y","y","n","n",null,null,"Config2","=Results!$N$15",null,"Calc","y","n","All works OK?","Done"]
[null,"Verandah beam",4,"y","n?","y","y","y","y",null,null,"Config3","=Results!$O$15",null,"Basic data","y","n","Tidy up wording for outputs","Done"]
[null,"Floor beam",5,"y","y","y","y","n","n",null,null,"Config4","=Results!$P$15",null,"Front","y","y","M27.  Move input data box away","Done"]
[null,"Deck beam/bearer",6,"n","n","n","n","y","y",null,null,"Configuration","=Calc!$P$113",null,"Results","y","n"]
[null,"Ridge/roof beam",7,"y","y","y","y","n","n",null,null,"DeadLoad","=Front!$V$17",null,"Changes","n ","n","Delete sheet?","Done"]
[null,"Garage door lintel",8,"n","n","y","y","n","n",null,null,"DeckHeight","=Front!$E$22",null,"Face loads","y","n"]
[null,"Cantilever lintel",9,"y","y","y","y","n","n",null,null,"Distance","=Front!$V$16",null,"Print","y","y?"]
[null,null,null,null,null,null,null,null,null,null,null,"FloorLD","=Front!$K$21",null,"Welcome","n?","n?","Cover on front sheet? & delete"]
[null,null,null,null,null,null,null,null,null,null,null,"Floorload","='Basic data'!$Q$5",null,"Schedule","y?","y?"]
[null,null,null,null,null,null,null,null,null,null,null,"FloorOp1","=Results!$M$11",null,"Functionality","n?","n","Delete sheet?"]
[null,null,null,null,null,null,null,null,null,null,null,"FloorOp2","=Results!$N$11",null,"BM issue","n","n","Delete sheet?"]
[null,null,null,null,null,null,null,null,null,null,null,"FloorOp3","=Results!$O$11",null,"Clean-up","n","n","Delete sheet?"]
[null,null,null,null,null,null,null,null,null,null,null,"LD","=Front!$K$15"]
[null,null,null,null,null,null,null,null,null,null,null,"LDcant","=Front!$O$21",null,"Action for macros",null,null,null,"Sheet","Needed?","Changes","Done?"]
[null,null,null,null,null,null,null,null,null,null,null,"LiveLoad","=Front!$V$18",null,"Module 1","Print beam",null,null,"Front",null,null,"Done"]
[null,null,null,null,null,null,null,null,null,null,null,"Overhang","=Front!$O$17",null,null,"Addbeamtoschedule",null,null,"Front",null,"Needs work"]
[null,null,null,null,null,null,null,null,null,null,null,"RoofOp1","=Results!$M$7",null,null,"Go (prints selected sheet)",null,null,"Print",null,null,"Done"]
[null,null,null,null,null,null,null,null,null,null,null,"RoofOp2","=Results!$N$7",null,null,"Input data (opens correct userform)",null,null,"Front (x2)","y"]
[null,null,null,null,null,null,null,null,null,null,null,"Roofslope","='Basic data'!$V$5",null,"Module 2","Selection (populates dropdown box on Front)",null,null,"Front","y"]
[null,null,null,null,null,null,null,null,null,null,null,"Roofweight","='Basic data'!$M$5",null,"Module 3","empty"]
[null,null,null,null,null,null,null,null,null,null,null,"SlopeOp1","=Results!$M$8",null,"Module 4","Schedule (nothing?)",null,null,null,"n","delete","Done"]
[null,null,null,null,null,null,null,null,null,null,null,"SlopeOp2","=Results!$N$8",null,null,"Newbeam (nothing?)",null,null,"Print","n","delete","Done"]
[null,null,null,null,null,null,null,null,null,null,null,"SlopeOp3","=Results!$O$8",null,null,"Printschedule",null,null,"Schedule"]
[null,null,null,null,null,null,null,null,null,null,null,"SlopeOp4","=Results!$P$8",null,null,"Back",null,null,"Schedule & Front"]
[null,null,null,null,null,null,null,null,null,null,null,"SlopeOp5","=Results!$Q$8",null,"Module 5","Newproject (clears ready for new peoject)",null,null,"Schedule"]
[null,null,null,null,null,null,null,null,null,null,null,"SlopeOp6","=Results!$R$8",null,null,"AlterBeam ",null,null,"Schedule"]
[null,null,null,null,null,null,null,null,null,null,null,"SnowLoad","=Front!$V$21",null,"Module 6","empty"]
[null,null,null,null,null,null,null,null,null,null,null,"Span","=Front!$E$15"]
[null,null,null,null,null,null,null,null,null,null,null,"Span_2","=Front!$O$19"]
[null,null,null,null,null,null,null,null,null,null,null,"Span2","=Front!$O$19"]
[null,null,null,null,null,null,null,null,null,null,null,"TotalLoad","=Front!$V$23"]
[null,null,null,null,null,null,null,null,null,null,null,"Userform","='Basic data'!$A$16"]
[null,null,null,null,null,null,null,null,null,null,null,"Wallheight","='Basic data'!$Y$5"]
[null,null,null,null,null,null,null,null,null,null,null,"WallhOp1","=Results!$M$10"]
[null,null,null,null,null,null,null,null,null,null,null,"WallhOp2","=Results!$N$10"]
[null,null,null,null,null,null,null,null,null,null,null,"WallhOp3","=Results!$O$10"]
[null,null,null,null,null,null,null,null,null,null,null,"Wallweight","='Basic data'!$O$5"]
[null,null,null,null,null,null,null,null,null,null,null,"WallwOp1","=Results!$M$9"]
[null,null,null,null,null,null,null,null,null,null,null,"WallwOp2","=Results!$N$9"]
[null,null,null,null,null,null,null,null,null,null,null,"WindDn","=Front!$V$20"]
[null,null,null,null,null,null,null,null,null,null,null,"WindUp","=Front!$V$19"]

{"sheet":"Functionality","index":15,"n_rows":18,"n_cols":8,"rows_kept":18,"cut":false,"hidden":true,"merged":[[1,0,1,1]]}
["Operations to be considered in lintels and beams"]
["Operations",null,"What? (red ones not written as yet)","Starting from\n(sheet)","Macro assigned to button?","Macro name","In module","Finish at\n(sheet)"]
[1,"New project","Clears project data from Front and Schedule","Welcome","New project","NewProject",5,"Front"]
[2,"Save project","Start save as and wait for file name","Welcome",null,null,null,"Welcome"]
[4,"Beam design(s)","Opens Front to enter new data and choose a beam option","Welcome","Design a new beam","NewBeam",4,"Front"]
[5,"Beam design(s)","Opens Front","Print","New beam","NewBeam",4,"Front"]
[6,"Beam design(s)","Opens Front","Schedule","New beam","NewBeam",4,"Front"]
[7,"Input data","Displays appropriate user form for inputting beam data","Front","Input beam data","InputData",1,"Front"]
[8,"Select beam","Sorts and lists beam options for selection","Front","Yes to calculate","Selection",2,"Front"]
[9,"Alter beam design","Insert schedule info. into front sheet for correction/redesign","Schedule","Alter beam","AlterBeam",5,"Front"]
[10,"Save beam","Add beam data to schedule","Front","Save beam","AddBeamToSchedule",1,"Schedule"]
[11,"Print beam (1)","Prepares to print beam data for Consent","Front","Print","PrintBeam",1,"Print"]
[12,"Print beam (2)","Prints beam data and clips ticket","Print","Print this calculation","Go",1,"Print"]
[13,"Go to schedule","Opens the schedule of beams for the project","Welcome","Beam schedule","Schedule",4,"Schedule"]
[14,"Print schedule ","Print","Schedule","Print this schedule","PrintSchedule",4,"Welcome"]
[15,"Print eng basis","Prints Engineering basis of \"Lintels and Beams\" for BCA","Welcome",null,null,null,"Welcome"]
[16,"Back","Back to Welcome","Schedule","Back to Welcome","Back",4,"Welcome"]
[17,"Exit","Exit (prompt for save)","Welcome",null,null,null,"Excel"]