{"text_format":"1","workbook":"xlsx","n_sheets":16,"sheets":["Combined","VSGMSG8","LVL","Glulam","Steel","Flitch","Start","Input beam data","Print","Calc","Basic data","Results","Face loads","Schedule","Clean-up","Functionality"],"not_rendered":{"charts":0,"images":1,"macros":1,"external_links":0,"defined_names":52,"comments":12,"pivot_tables":0},"unopened":[],"bounds":{"document_bytes":16777216,"sheet_cells":100000,"rows_first":2000,"rows_last":500,"rows_between":2000,"halvings":0,"cell_chars":16384,"cell_head_chars":4096},"cells_cut":0,"cells_raw":0,"read":"whole","date_system":"1900"}

{"sheet":"Combined","index":0,"n_rows":109,"n_cols":8,"rows_kept":109,"cut":false,"hidden":true,"merged":[]}
["Combined member properties"]
[]
[null,1,2,3,4,5,6,7]
[null,"Section","EI(s) (green)","EI(s) (dry)","EI(l) (green)","EI(l) \n(dry)","Bearing width"]
[1,"70x45",5.6594999999999995,6.9457499999999994,2.8297499999999998,3.4728749999999997,45,"VSG/MSG8"]
[2,"90x45",12.028499999999999,14.76225,6.0142499999999997,7.3811249999999999,45]
{"$rows_left_out":104}
{"sheet":"VSGMSG8","index":1,"n_rows":53,"n_cols":13,"rows_kept":53,"cut":false,"hidden":true,"merged":[]}
["VSG/MSG8 properties",null,null,"(k1 = 1.0)",null,"Note:  I have offset all properties down 1 row to allow the Vlookup function to pick the correct size in the last column"]
[]
["Sorted by width",null,null,null,null,null,null,null,null,null,"Used for face load (wind only)"]
["fM (green)","fM (dry)","fM x k8","EI(s) (green)","EI(s) (dry)","EI(l) (green)","EI(l) (dry)","Index","Size","k8","fM (dry)","fM (dry)","EI(s) (dry)"]
[0,0,0,0,0,0,0,0,"70x45",1,0.2646,0.41160000000000002,2.8704375000000004]
[0.34397999999999995,0.41160000000000002,{"$f":"B6*J5","v":0.41160000000000002},5.6594999999999995,6.9457499999999994,2.8297499999999998,3.4728749999999997,1,"90x45",1,0.34020000000000006,0.68040000000000012,3.6905625]
{"$rows_left_out":48}
{"sheet":"LVL","index":2,"n_rows":33,"n_cols":10,"rows_kept":33,"cut":false,"hidden":true,"merged":[]}
["LVL section properties",null,null,null,null,"Note:  I have offset all properties down 1 row to allow the Vlookup function to pick the correct size in the last column"]
[null,null,null,null,"Data from:","Nelson Pine",null,"CHH"]
["Sorted by width",null,null,null,null,null,null,"Used for face load (wind only)"]
["fM (dry)","fM x k8","EI(s)","EI(l)","Index","Size","k8","fM (dry)","fM (dry)","EI(s) (dry)"]
[0,0,0,0,0]
[0,0,0,0,1,"90 x45",1,1.0388250000000001,2.0776500000000002,7.5178124999999998]
{"$rows_left_out":28}
{"sheet":"Glulam","index":3,"n_rows":22,"n_cols":8,"rows_kept":22,"cut":false,"hidden":true,"merged":[]}
["Glulam (GL8)",null,null,null,"Note:  I have offset all properties down 1 row to allow the Vlookup function to pick the correct size in the last column"]
[]
["Sorted by width",null,null,null,null,"Used for face load (wind only)"]
["fM (dry)","EI(s)","EI(l)","Index","Size","fM (dry)","fM (dry)","EI(s) (dry)"]
[0,0,0,0,"135x65",1.3871520000000002,2.4008400000000005,24.716249999999999]
[2.4008400000000005,106.61624999999999,71.077500000000001,1,"180x65",1.9111872000000005,4.2681600000000008,32.954999999999998]
{"$rows_left_out":17}
{"sheet":"Steel","index":4,"n_rows":84,"n_cols":34,"rows_kept":84,"cut":false,"hidden":true,"merged":[]}
["Hot rolled steel properties",null,null,null,null,"fy changed see col C",null,null,null,"fy",320,null,"Note:  I have offset all properties (columns A - F) down 1 row to allow the Vlookup function to pick the correct size in the last column"]
[null,null,"Others","Lintel up","Lintel dn",null,null,null,null,null,300,null,"Lintels up",null,"On the assumption partially restrained at ends, and unrestrained between",null,null,null,null,null,null,null,"Others",null,"Lintels down",null,null,null,"Face loading parameters"]
["Iex","Zex","fM","faaM","faaM","EI","Index","Size",null,"f",0.9,"kt","Iw","J","alpha m","Iy","Mo","alpha s","am x as",null,"Mo","alpha s","am x as",null,"Mo","alpha s","am x as",null,"Iey","Zey","fMy","fMx","faaMx","EIy"]
[0,0,0,0,0,0,1,"150UB14",null,null,null,{"$f":"2*LEFT(H4,3)/(Span*1000)+1","v":1.1000000000000001},2.5299999999999998,28.2,{"$f":"1.7/(0.75^2*2+1)^0.5","v":1.16619037896906},0.496,{"$f":"((PI()^2*205*P4/1000000)/Span^2*(80*N4/1000000000+(PI()^2*205*M4/1000000000/Span^2)))^0.5*1000000","v":17.747509737604446},{"$f":"0.6*(((C5/K$3/Q4)^2+3)^0.5-(C5/K$3/Q4))","v":0.41232643050194012},{"$f":"MIN(O4*R4,1)","v":0.48085111624601734},null,{"$f":"((PI()^2*205*$P4/1000000)/(1.2)^2*(80*$N4/1000000000+(PI()^2*205*$M4/1000000000/(1.2)^2)))^0.5*1000000","v":63.636059285800116},{"$f":"0.6*((($C5/$K$3/U4)^2+3)^0.5-($C5/$K$3/U4))","v":0.77609039198875462},{"$f":"MIN($O4*V4,1)","v":0.9050691483476121},null,{"$f":"((PI()^2*205*$P4/1000000)/(Span*1.2)^2*(80*$N4/1000000000+(PI()^2*205*$M4/1000000000/(Span*1.2)^2)))^0.5*1000000","v":14.327417648480777},{"$f":"0.6*((($C5/$K$3/Y4)^2+3)^0.5-($C5/$K$3/Y4))","v":0.35019720314871694},{"$f":"MIN($O4*Z4,1)","v":0.40839660905390707},null,0.495,20.8,{"$f":"$K$3*$K$1*AD4/1000","v":5.9904000000000002},18.252209712984538,24.236327778605396,{"$f":"AC4*210","v":103.95}]
[6.67,102,{"$f":"$K$3*$K$1*B5/1000","v":29.376000000000001},{"$f":"C5*S4","v":14.125482390843006},{"$f":"C5*AA4","v":11.997058787567575},{"$f":"A5*210","v":1400.7},2,"150UB18",null,null,{"$f":"Span&\" m\"","v":"3 m"},1.1000000000000001,3.56,60.4,{"$f":"1.7/(0.75^2*2+1)^0.5","v":1.16619037896906},0.67200000000000004,29.169814190401105,0.47874037650233731,{"$f":"MIN(O5*R5,1)","v":0.55830242110105122},null,{"$f":"((PI()^2*205*$P5/1000000)/(1.2)^2*(80*$N5/1000000000+(PI()^2*205*$M5/1000000000/(1.2)^2)))^0.5*1000000","v":96.359522844718811},{"$f":"0.6*((($C6/$K$3/U5)^2+3)^0.5-($C6/$K$3/U5))","v":0.80448632164851352},{"$f":"MIN($O5*V5,1)","v":0.93818420831870508},null,23.774623249269897,{"$f":"0.6*((($C6/$K$3/Y5)^2+3)^0.5-($C6/$K$3/Y5))","v":0.41595548565671508},{"$f":"MIN($O5*Z5,1)","v":0.48508328545226398},null,0.67200000000000004,28.2,8.121599999999999,26.864654078926137,33.813127217949244,{"$f":"AC5*210","v":141.12}]
[9.0500000000000007,135,38.880000000000003,{"$f":"C6*S5","v":21.706798132408874},{"$f":"C6*AA5","v":18.860038138384024},1900.5000000000002,3,"180UB16",null,null,null,1.1200000000000001,5.88,31.5,1.16619037896906,0.85299999999999998,27.142593409703114,0.44962828843856284,0.52435218408937745,null,113.67456969049377,0.83196252589265518,0.97022669335881195,null,21.396834029299871,0.37829403288243119,0.44116286156889645,null,0.85299999999999998,29.4,8.4671999999999983,27.151918089845726,35.580146158461758,179.13]
{"$rows_left_out":79}
{"sheet":"Flitch","index":5,"n_rows":54,"n_cols":12,"rows_kept":54,"cut":false,"hidden":true,"merged":[]}
["Flitch beams",null,null,null,"Note:  I have offset all properties down 1 row to allow the Vlookup function to pick the correct size in the last column"]
[]
[null,null,null,null,null,null,null,"Assumes restrained at tension edge (NZS 3603)",null,"Used for face load (wind only)"]
["fM (short)","fM (long)","fM xk8","EI(s)","EI(l)","Index","Code","k8",null,"fM (dry)","fM (dry)","EI(s) (dry)"]
[0,0,0,0,0,0,"FB15L",1,"Mitek",1.0616666666666665,6.3722307692307689,12.998066666666666]
[6.3722307692307689,5.4676153846153852,{"$f":"A6*H5","v":6.3722307692307689},322.1516666666667,291.96766666666667,1,"FB20M",1,null,1.4408333333333332,15,18.630933333333331]
{"$rows_left_out":49}
{"sheet":"Start","index":6,"n_rows":27,"n_cols":6,"rows_kept":27,"cut":false,"hidden":false,"merged":[[16,4,18,9],[13,5,14,9],[3,1,5,9],[25,1,25,9]]}
[]
[null,"Welcome to the BRANZ Lintels and beams calculator"]
[]
[null,"Calculator for selecting sizes and details of lintels and beams and their fixings and supports for various applications.  \nThe calculator is intended for buildings generally within the scope of NZS 3604."]
[]
[]
{"$rows_left_out":22}
{"sheet":"Input beam data","index":7,"n_rows":38,"n_cols":23,"rows_kept":38,"cut":false,"hidden":false,"merged":[[30,10,30,18],[19,13,20,13],[35,17,37,23],[3,3,3,9],[9,1,9,3],[18,12,23,12],[29,0,31,1],[25,0,28,1],[32,0,33,1],[34,0,35,1],[35,10,37,15],[29,10,29,23],[4,3,5,9],[6,3,6,9],[16,10,16,12]]}
["BRANZ Lintels and beams calculator"]
[]
[null,"Project data",null,null,null,null,null,null,null,null,null,null,"Site information"]
[null,null,"Owner's name:","BRANZ",null,null,null,null,null,null,null,null,null,"Wind zone:  "]
[null,null,"Site address:","1222 Moonshine Road"]
[null,null,null,null,null,null,null,null,null,null,null,null,null,"Site elevation:"]
{"$rows_left_out":33}
{"sheet":"Print","index":8,"n_rows":73,"n_cols":8,"rows_kept":73,"cut":false,"hidden":false,"merged":[[40,1,41,1],[49,2,49,8],[65,2,65,8],[67,2,67,8],[56,2,56,8],[54,2,54,8],[50,2,51,8],[59,5,60,8],[59,2,60,4],[61,2,63,8],[10,2,10,3],[40,2,40,3],[40,4,40,5],[14,2,15,5],[72,2,74,8],[70,5,71,8],[70,2,71,4]]}
[]
[null,"BRANZ Lintels and Beams Calculator"]
[]
[]
[null,"Project information"]
[]
{"$rows_left_out":68}
{"sheet":"Calc","index":9,"n_rows":126,"n_cols":53,"rows_kept":126,"cut":false,"hidden":true,"merged":[[1,36,1,37],[2,36,2,37],[101,31,101,32],[115,31,115,32],[114,2,114,7],[114,10,114,13],[114,33,114,34],[45,31,45,32],[30,2,30,7],[30,33,30,34],[44,2,44,7],[44,10,44,13],[44,33,44,34],[59,31,59,32],[73,31,73,32],[87,31,87,32],[31,31,31,32],[62,35,62,37],[2,2,2,7],[2,33,2,34],[16,2,16,7],[16,33,16,34],[30,10,30,13],[16,10,16,13],[2,10,2,13],[3,31,3,32],[17,31,17,32],[100,2,100,7],[100,10,100,13],[100,33,100,34],[58,2,58,7],[58,10,58,13],[58,33,58,34],[72,2,72,7],[72,10,72,13],[72,33,72,34],[86,2,86,7],[86,10,86,13],[86,33,86,34]]}
["Application 1.  Roof only",null,null,null,null,null,null,"(dry props)",null,null,null,"Note: ",null,null,null,null,null,null,null,null,null,"= critical load case"]
[null,null,"Basic loads",null,null,null,null,null,null,null,null,null,null,null,"Note have ignored ceiling on the horizontal plane for now",null,null,null,null,null,null,null,null,null,null,null,null,null,null,null,null,null,null,null,null,null,"Req. bearing area"]
[null,null,"Roof",null,null,null,null,null,"Upper wall","Lower wall","Floor/deck",null,null,null,"Actions",null,null,null,null,null,"Size index's",null,null,null,null,null,null,null,null,null,null,null,null,"Deflection limits",null,"Strength","(mm2)"]
["Load case",null,"G","Ql","Qs","S","W(e)","W(r)","G","G","G","Ql","Qs","S","UDL","P","M*","V*","EI(s)","EI(a)","MSG8",null,null,null,"LVL",null,null,"GL",null,"UB","MSC","Flitch",null,"(span/)","(mm)","dur. fact.","para","perp"]
[1,"G+Ql",{"$f":"VLOOKUP('Basic data'!M$5,'Basic data'!$G$7:$Y$14,7)","v":0.85},0,null,null,null,null,null,null,null,null,null,null,{"$f":"('Input beam data'!$K$15+'Input beam data'!$O$17)*(C5/VLOOKUP('Basic data'!V$5,'Basic data'!$G$7:$Y$14,16)+D5)","v":2.2879603587062833},{"$f":"IF('Input beam data'!X$23=0,'Input beam data'!X$17,'Input beam data'!X$23)","v":0},null,null,{"$f":"(0.013*O5*Span^3+0.0298*P5*Span^2*(3*MIN('Input beam data'!X$16,Span-'Input beam data'!X$16)/Span-4*(MIN('Input beam data'!X$16,Span-'Input beam data'!X$16)/Span)^3))*AH5","v":240.92222577177159},{"$f":"(0.013*O5*Span^4+0.0208*P5*Span^3*(3*MIN('Input beam data'!X$16,Span-'Input beam data'!X$16)/Span-4*(MIN('Input beam data'!X$16,Span-'Input beam data'!X$16)/Span)^3))/(AI5/1000)","v":200.76852147647634},{"$f":"VLOOKUP(MAX(S5:T5),VSGMSG8!G$5:I$11,2)","v":5},{"$f":"VLOOKUP(MAX(S5:T5),VSGMSG8!G$12:I$17,2)","v":4},{"$f":"VLOOKUP(MAX(S5:T5),VSGMSG8!G$18:I$23,2)","v":3},{"$f":"VLOOKUP(MAX(S5:T5),VSGMSG8!G$24:I$29,2)","v":3},{"$f":"VLOOKUP(MAX(S5:T5),LVL!D$5:F$14,2)","v":5},{"$f":"VLOOKUP(MAX(S5:T5),LVL!D$15:F$26,2)","v":4},{"$f":"VLOOKUP(MAX(S5:T5),LVL!D$27:F$33,2)","v":1},{"$f":"VLOOKUP(MAX(S5:T5),Glulam!C$5:E$11,2)","v":2},{"$f":"VLOOKUP(MAX(S5:T5),Glulam!C$12:E$20,2)","v":2},{"$f":"VLOOKUP(MAX(S5:T5),Steel!$F$4:$H$24,2)","v":1},{"$f":"VLOOKUP(MAX(S5:T5),Steel!$F$26:$H$35,2)","v":1},{"$f":"VLOOKUP(MAX(S5:T5),Flitch!$E$5:$F$10,2)","v":0},{"$f":"VLOOKUP(MAX(S5:T5),Flitch!E$44:F$54,2)","v":0},300,12]
[2,"G+Qs",{"$f":"VLOOKUP('Basic data'!M$5,'Basic data'!$G$7:$Y$14,7)","v":0.85},null,{"$f":"0.7*'Basic data'!$M$11","v":0.17499999999999999},null,null,null,null,null,null,null,null,null,{"$f":"('Input beam data'!$K$15+'Input beam data'!$O$17)*(C6/VLOOKUP('Basic data'!V$5,'Basic data'!$G$7:$Y$14,16)+E6)","v":2.7429603587062834},{"$f":"IF('Input beam data'!X$23=0,'Input beam data'!X$17+0.7*'Input beam data'!X$18,'Input beam data'!X$23)","v":0},null,null,{"$f":"(0.013*O6*Span^3+0.0298*P6*Span^2*(3*MIN('Input beam data'!X$16,Span-'Input beam data'!X$16)/Span-4*(MIN('Input beam data'!X$16,Span-'Input beam data'!X$16)/Span)^3))*AH6","v":288.83372577177158},{"$f":"(0.013*O6*Span^4+0.0208*P6*Span^3*(3*MIN('Input beam data'!X$16,Span-'Input beam data'!X$16)/Span-4*(MIN('Input beam data'!X$16,Span-'Input beam data'!X$16)/Span)^3))/(AI6/1000)","v":240.69477147647632},{"$f":"VLOOKUP(MAX(S6:T6),VSGMSG8!E$5:I$11,4)","v":5},{"$f":"VLOOKUP(MAX(S6:T6),VSGMSG8!E$12:I$17,4)","v":3},{"$f":"VLOOKUP(MAX(S6:T6),VSGMSG8!E$18:I$23,4)","v":2},{"$f":"VLOOKUP(MAX(S6:T6),VSGMSG8!E$24:I$29,4)","v":3},{"$f":"VLOOKUP(MAX(S6:T6),LVL!C$5:F$14,3)","v":4},{"$f":"VLOOKUP(MAX(S6:T6),LVL!C$15:F$26,3)","v":4},{"$f":"VLOOKUP(MAX(S6:T6),LVL!C$27:F$33,3)","v":1},{"$f":"VLOOKUP(MAX(S6:T6),Glulam!B$5:E$11,3)","v":2},{"$f":"VLOOKUP(MAX(S6:T6),Glulam!B$12:E$20,3)","v":1},{"$f":"VLOOKUP(MAX(S6:T6),Steel!$F$4:$H$24,2)","v":1},{"$f":"VLOOKUP(MAX(S6:T6),Steel!$F$26:$H$35,2)","v":1},{"$f":"VLOOKUP(MAX(S6:T6),Flitch!$D$5:$F$10,3)","v":0},{"$f":"VLOOKUP(MAX(S6:T6),Flitch!$D$44:$F$54,3)","v":0},300,12]
{"$rows_left_out":121}
{"sheet":"Basic data","index":10,"n_rows":79,"n_cols":41,"rows_kept":79,"cut":false,"hidden":true,"merged":[[4,39,5,39],[4,37,5,37],[4,30,5,30],[4,31,5,31],[3,28,5,28],[3,29,5,29],[4,32,5,32],[18,8,18,9],[23,8,23,9],[18,10,18,11],[31,16,31,25],[29,13,32,13],[49,16,49,25],[48,13,49,13],[45,0,47,0],[36,16,36,23],[44,16,44,23],[33,13,37,13],[38,13,43,13],[45,13,46,13],[43,0,44,0],[34,16,34,25]]}
["Basic data from AS/NZS 1170 and/or NZS 3604"]
["This is the only sheet where data should be changed.  Ensure all yellow cells are appropriate for the use of the spreadsheet."]
[null,null,null,null,null,null,null,null,null,null,null,null,null,null,null,null,null,null,null,null,null,null,null,null,null,null,"Table of options for foundation",null,null,"See also Range (AB5:AH16) in \"Results\""]
[null,null,null,null,null,"Col no.",1,2,3,4,5,6,7,8,9,10,11,12,13,14,15,16,17,18,19,null,null,null,"Internal pad footing (timber floor)","Foundation wall with timber subfloor",null,null,null,null,null,"Table of options for supports"]
[null,{"$f":"T5","v":1},null,null,null,null,"Cell links",null,3,1,null,null,2,null,1,null,1,null,null,1,{"$f":"MAX(V5-1,1)","v":2},3,null,null,2,null,null,null,null,null,"Concrete slab edging","Local slab thickening","External pad footing",null,null,null,null,"Prop studs","Post","Wall studs","Pile"]
["Index","Application","Results index","Application",null,null,"Index","Wind zone","(kPa)","Snow region","sg (kPa)","Roof","(kPa)","Wall","(kPa)","Floor/live load","(kPa)","Floor load","(kPa)","Application","Roof slope","Cos","m1","Wall ht","(m)",null,null,null,null,null,null,null,null,"Pile footing"]
{"$rows_left_out":74}
{"sheet":"Results","index":11,"n_rows":52,"n_cols":34,"rows_kept":52,"cut":false,"hidden":true,"merged":[[12,0,13,0],[24,4,24,5],[4,28,5,28],[4,29,5,29],[19,9,22,26],[4,32,5,32],[4,33,5,33],[4,30,5,30],[4,31,5,31],[5,0,6,0]]}
["A","This sheet takes the results from the load calculation and sorts and enables data required for selecting an option by the user."]
["B","It then takes the results of that selection and calculates deflection, required supports and fixings"]
[null,null,null,null,null,null,null,null,null,null,null,null,null,null,null,null,null,null,null,null,null,null,null,null,null,null,null,"Foundations options"]
["A",null,null,null,null,null,null,null,null,null,null,null,null,null,null,null,null,null,null,null,null,null,null,null,null,null,"End 1",3,"Foundation fixings"]
[null,null,"Selection",null,null,null,null,null,"Faceload results",null,null,"Data for input forms",null,null,null,null,null,null,null,null,null,null,null,null,null,null,"End 2",3,"Internal pad footing (with timber floor)","Foundation wall with timber sub-floor","Concrete slab edging (NZS3604)","Local slab thickening","External pad footing","Pile footing"]
["Timber \n(VSG/MSG8)",{"$f":"IF('Basic data'!T5=1,VLOOKUP(INDEX(Calc!$AO$14:$BA$27,Results!I6,1),VSGMSG8!H5:I11,2),VLOOKUP(INDEX(Calc!$U$1:$AE$126,'Basic data'!$T$5*14,1),VSGMSG8!H5:I11,2))","v":"290x45"},1,"140x45",{"$f":"IF(D6=\"\",\"\",D6&IF(MATCH(D6,Combined!B$5:B$109,0)<22,\"  VSG/MSG8 (SG8)\",IF(AND(MATCH(D6,Combined!B$5:B$109,0)>21,MATCH(D6,Combined!B$5:B$109,0)<48),\"  LVL\",IF(AND(MATCH(D6,Combined!B$5:B$109,0)>47,MATCH(D6,Combined!B$5:B$109,0)<62),\"  Glulam\",IF(AND(MATCH(D6,Combined!B$5:B$109,0)>90,MATCH(D6,Combined!B$5:B$109,0)<96),\"  Mitek flitch beam\",IF(MATCH(D6,Combined!B$5:B$109,0)>95,\"  Pryda flitch beam\",\"\"))))))","v":"140x45  VSG/MSG8 (SG8)"},null,null,null,1,{"$f":"MAX('Face loads'!F7,'Face loads'!I7)","v":1},null,null,"Opt1","Opt2","Opt3","Opt4","Opt5","Opt6",null,null,null,null,null,null,null,"End 1",{"$f":"IF($AB$4=1,AC5,IF($AB$4=2,AD5,IF($AB$4=3,AE5,IF($AB$4=4,AF5,IF($AB$4=5,AG5,AH5)))))","v":"Concrete slab edging (NZS3604)"}]
{"$rows_left_out":47}
{"sheet":"Face loads","index":12,"n_rows":21,"n_cols":9,"rows_kept":21,"cut":false,"hidden":true,"merged":[]}
["Bending about 2 axes",null,null,null,"LD",400,"mm"]
[null,null,null,null,"Deflection limit",100]
["ULS:","Mx*",{"$f":"MAX(Calc!Q11:Q12)","v":4.7852464842534834},"kNm",null,"SLS:","w",{"$f":"IF('Basic data'!T5=1,0.71*VLOOKUP('Basic data'!I$5,'Basic data'!$G$7:$Y$14,3)*'Basic data'!$H$20*(F1/2000),0.1)","v":0.16471999999999998},"kN/m"]
[null,"My*",{"$f":"IF('Basic data'!T5=1,VLOOKUP('Basic data'!I$5,'Basic data'!$G$7:$Y$14,3)*'Basic data'!$H$20*(F1/2000)*Span^2/8,0)","v":0.26100000000000001},"kNm"]
[null,null,null,null,null,"\"0\" = Means size is OK, \"1\" = size must be incremented (done in \"Results sheet\" by macro \"Selection\" in module 2)"]
["Calculated size",null,"fMx","fMy","Eqn result","What to do?","EIface","dface","What to do?"]
{"$rows_left_out":16}
{"sheet":"Schedule","index":13,"n_rows":12,"n_cols":16,"rows_kept":12,"cut":false,"hidden":true,"merged":[[4,15,5,17],[2,2,2,4],[3,2,3,4]]}
["Schedule of beams",null,null,null,null,null,null,null,null,null,null,null,null,"Produced by BRANZ Lintels and Beams",null,"To design a new beam, press button"]
[null,null,null,null,null,null,null,null,null,null,null,"Date:",null,{"$f":"LastModified()","v":"2020-07-16T13:16:57"}]
[null,"Project ref:",{"$f":"'Input beam data'!D7","v":"Project reference"},null,null,null,"Wind zone:",{"$f":"Print!C17","v":"High"},null,"Snow load:",{"$f":"Print!C18","v":0}]
[null,"Title:",{"$f":"'Input beam data'!D4","v":"BRANZ"}]
[1,2,3,4,5,6,7,8,9,10,11,12,13,14,null,"To alter beam details, select beam Id and press button"]
["Id","Beam ref","Opening","Application","Span\n(m)","Loaded dim. (m)","Roof \nweight","Roof slope\n(deg)","Roof o/h\n(m)","Wall \nweight","Wall\nheight (m)","Floor live load (kPa)","LD floor\n(m)","Selected beam"]
{"$rows_left_out":7}
{"sheet":"Clean-up","index":14,"n_rows":49,"n_cols":22,"rows_kept":49,"cut":false,"hidden":true,"merged":[[0,14,0,16],[21,14,21,15],[3,3,5,3],[3,4,5,4],[4,5,5,5],[4,6,5,6],[0,11,0,12]]}
["Notes for cleanup exercise",null,null,null,null,null,null,null,null,null,null,"Named cells",null,null,"Action for each sheet"]
[null,null,null,null,null,null,null,null,null,null,null,"Appplication","=Print!$C$23",null,"Sheet","Needed?","Visible?","Changes","Done?"]
[null,"Table of options","See also Range (AB5:AH16) in \"Results\"",null,null,null,null,null,null,null,null,"Beam","=Print!$C$46",null,"Combined","y","n","None"]
[null,null,null,"Isolated pad footing (timber floor)","Foundation wall with timber subfloor",null,null,null,null,null,null,"Beamref","=Front!$B$10",null,"VSGMSG8","y","n","None"]
[null,null,null,null,null,"Concrete slab edging","Local slab thickening",null,null,null,null,"BSpan","=Front!$O$23",null,"LVL","y","n","Remove note to Doug","Done"]
[null,null,null,null,null,null,null,"Pad footing","Pile footing",null,null,"ConcOp1","=Results!$M$13",null,"Glulam","y","n","None"]
{"$rows_left_out":44}
{"sheet":"Functionality","index":15,"n_rows":18,"n_cols":8,"rows_kept":18,"cut":false,"hidden":true,"merged":[[1,0,1,1]]}
["Operations to be considered in lintels and beams"]
["Operations",null,"What? (red ones not written as yet)","Starting from\n(sheet)","Macro assigned to button?","Macro name","In module","Finish at\n(sheet)"]
[1,"New project","Clears project data from Front and Schedule","Welcome","New project","NewProject",5,"Front"]
[2,"Save project","Start save as and wait for file name","Welcome",null,null,null,"Welcome"]
[4,"Beam design(s)","Opens Front to enter new data and choose a beam option","Welcome","Design a new beam","NewBeam",4,"Front"]
[5,"Beam design(s)","Opens Front","Print","New beam","NewBeam",4,"Front"]
{"$rows_left_out":12}